{"text_format":"3","workbook":"xlsx","n_sheets":10,"sheets":["Overview_install_situations","corner_1_sash","corner_2_sashes_corner entry","corner_2_sashes_on_one_side","recess_1_sash","recess_2_sashes","U-shower_1_sash_front","U-shower_1_sash_side","U-shower_2_sashes_corner entry","Glass_drill_holes"],"not_rendered":{"images":33,"defined_names":451},"read":"whole","date_system":"1900"}

{"sheet":"Overview_install_situations","index":0,"n_rows":21,"n_cols":16,"rows_kept":21,"merged":[[1,1,1,15],[3,1,3,5],[3,7,3,9],[3,11,3,15],[6,1,15,1],[6,3,15,3],[6,5,15,5],[6,7,15,7],[6,9,15,9],[6,11,15,11],[6,13,15,13],[6,15,15,15],[20,1,21,15]]}
[]
[null,"Choose your installation situation:"]
[]
[null,"Corner shower",{"$nulls":5},"Recess shower",{"$nulls":3},"U-shower"]
[]
[null,"Corner shower \nwith 1 sliding sash",null,"Corner shower \nwith 2 sliding sashes\nand corner entry",null,"Corner shower \nwith 2 sliding sashes\non one side",null,"Recess shower \nwith 1 sliding sash",null,"Recess shower \nwith 2 sliding sashes",null,"U-shower \nwith 1 sliding sash,\ndoor at the front",null,"U-shower \nwith 1 sliding sash,\ndoor at the side",null,"U-shower \nwith 2 sliding sashes\nand corner entry"]
{"$rows_empty":11}
[null,"Choose",null,"Choose",null,"Choose",null,"Choose",null,"Choose",null,"Choose",null,"Choose",null,"Choose"]
[]
[]
[null,"Please contact us for divergent installation situations! Extension solutions to or on bathtubs are also possible."]

{"sheet":"corner_1_sash","index":1,"n_rows":232,"n_cols":17,"rows_kept":232,"merged":[[0,1,0,14],[3,1,3,17],[4,1,26,17],[28,1,28,5],[28,7,28,17],[29,8,58,11],[29,12,29,17],[30,12,30,17],[31,12,31,17],[32,12,32,17],[33,12,33,17],[34,12,34,17],[35,12,35,17],[36,12,36,17],[37,12,37,17],[38,2,39,3],[38,4,39,4],[38,12,38,17],[41,2,42,3],[41,4,42,4],[44,2,45,3],[44,4,45,4],[47,2,48,3],[50,3,50,4],[53,2,54,3],[53,4,54,4],[56,2,57,3],[56,4,57,4],[60,1,60,16],[62,1,62,17],[64,2,64,5],[64,7,64,16],[66,7,66,10],[68,7,68,10],[70,7,70,10],[72,7,72,10],[74,7,74,10],[76,7,76,10],[78,7,78,10],[80,7,80,10],[88,2,89,16],[92,1,92,5],[92,7,92,17],[94,8,94,16],[96,9,96,10],[100,2,101,4],[100,9,100,10],[104,8,105,8],[104,9,105,10],[104,11,105,11],[104,12,105,12],[104,13,105,13],[104,14,105,14],[104,16,105,16],[109,9,109,10],[110,8,110,16],[112,8,114,16],[115,2,115,4],[123,2,123,4],[128,1,128,16],[130,1,130,17],[132,2,132,3],[134,2,134,3],[134,4,134,7],[134,11,134,12],[134,14,134,16],[135,2,135,3],[135,4,135,7],[135,11,135,12],[136,2,136,3],[136,4,136,7],[136,11,136,12],[137,4,137,7],[139,2,139,3],[141,2,141,3],[141,4,141,7],[141,11,141,12],[141,14,141,16],[142,2,142,3],[142,4,142,7],[143,2,143,3],[143,4,143,7],[144,2,144,3],[144,4,144,7],[145,2,145,3],[145,4,145,7],[147,2,147,12],[149,2,149,3],[149,4,149,7],[149,11,149,12],[149,14,149,16],[150,2,150,3],[150,4,150,7],[150,11,150,12],[151,2,151,3],[151,4,151,7],[151,11,151,12],[153,2,153,12],[155,2,155,3],[155,4,155,7],[155,11,155,12],[155,14,155,16],[156,2,156,3],[156,4,156,7],[156,11,156,12],[157,2,157,3],[157,4,157,7],[157,11,157,12],[159,2,159,12],[161,2,161,3],[161,4,161,7],[161,11,161,12],[161,14,161,16],[162,2,162,3],[162,4,162,7],[162,11,162,12],[164,2,164,12],[166,2,166,3],[166,4,166,7],[166,11,166,12],[166,13,168,16],[167,2,167,3],[167,4,167,7],[168,2,168,3],[168,4,168,7],[170,2,170,3],[170,4,170,7],[170,11,170,12],[171,2,171,3],[171,4,171,7],[171,11,171,12],[172,2,172,3],[172,4,172,7],[173,2,173,3],[173,4,173,7],[175,2,175,3],[177,11,177,12],[178,2,178,3],[178,5,178,7],[179,2,179,3],[180,2,180,3],[182,2,182,3],[183,2,183,3],[183,4,183,7],[184,2,184,3],[184,4,184,7],[185,2,185,3],[185,4,185,7],[188,4,188,5],[188,8,188,9],[189,2,189,3],[189,4,189,5],[189,8,189,9],[190,2,190,3],[190,4,190,5],[190,8,190,9],[191,2,191,3],[191,4,191,5],[191,8,191,9],[192,2,192,3],[192,4,192,5],[193,8,193,9],[194,2,194,3],[194,8,194,9],[196,2,196,3],[196,4,196,7],[197,2,197,3],[197,4,197,7],[198,2,198,3],[198,4,198,7],[201,4,201,5],[201,8,201,9],[202,2,202,3],[202,4,202,5],[202,8,202,9],[203,2,204,3],[203,4,203,5],[203,8,203,9],[204,4,204,5],[204,8,204,9],[205,2,205,3],[205,4,205,5],[207,2,207,3],[209,2,209,12],[211,2,211,3],[211,4,211,7],[211,13,212,16],[212,2,212,3],[212,4,212,7],[215,2,215,16],[231,1,231,16]]}
[null,"Aquant 40: corner shower with 1 sliding sash"]
[]
[]
[null,"Drawings"]
{"$rows_empty":24}
[null,"User input",{"$nulls":5},"Legend & Formulas"]
[{"$nulls":8},"Legend\nW1 = System width of side 1\nW2 = System width of side 2\nH = System height\nLS1 = Length of track profile/cover profile 1\nLS2 = Length of track profile/cover profile 2\nLWt = Clearance with open door\n\nWS1 = Glass width of sliding sash 1 with handle\nWSZ = Additional width of sliding sash for handle\nHS1 = Glass height of sliding sash 1\n\nWF1 = Glass width of fixed sash 1\nWF2 = Glass width of fixed sash 2\nWFA = Allowance for fixed sash for wall attachment\nWFZ1 = Additional width of fixed sash 1\nHF1 = Glass height of fixed sash 1\nHF2 = Glass height of fixed sash 2\n\nUF = Overlap between sliding sash and fixed sash\n\nSMs = Size of gap on the closing side\nSMo1 = Size of gap on the opening side for sliding sash 1",{"$nulls":3},"Formulas"]
[null,null,"W1","System width of side 1 (max. 1,500 mm)",900,"(mm)",{"$nulls":6},{"$f":"\"WS1 = (W1 - WFA - WFZ1 + WSZ + UF - SMs - \"&E1_Glasstärke&\") / 2\"","v":"WS1 = (W1 - WFA - WFZ1 + WSZ + UF - SMs - 8) / 2"}]
[{"$nulls":12},"WF1 = WS1 - WSZ + WFZ1"]
[null,null,"W2","System width of side 2 (max. 1,500 mm)",900,"(mm)",{"$nulls":6},"WF2 = W2 - WFA"]
[{"$nulls":12},{"$f":"\"HS1 = H - \"&E1_HSA_System","v":"HS1 = H - 30"}]
[null,null,"H","System height (max. 2,500 mm)",{"v":2000,"d":"2,000"},"(mm)",{"$nulls":6},{"$f":"\"HF1 = HF2 = H - \"&E1_HFA_System","v":"HF1 = HF2 = H - 42"}]
[{"$nulls":12},"SMo1 = WFZ1 + WFA"]
[null,null,"WFZ1","Additional width of fixed sash 1",17,"(mm)",{"$nulls":6},{"$f":"\"LS1 = W1 - \"&E1_Eckenabzug","v":"LS1 = W1 - 49"}]
[{"$nulls":12},{"$f":"\"LS2 = W2 - \"&E1_Eckenabzug","v":"LS2 = W2 - 49"}]
[null,null,"Do you wish to attach the fixed sash to the wall via a wall profile or directly via silicon?",null,"Silicon",{"$nulls":7},{"$f":"\"LWt = W1 - WFA - WF1 - WSZ - \"&E1_Glasstärke","v":"LWt = W1 - WFA - WF1 - WSZ - 8"}]
[]
[]
[null,null,"Do you wish to use the Aquant floor profile?",null,"No"]
[]
[]
[null,null,"Do you wish to use vertical sealing strips between fixed and sliding sash?",null,"No"]
[]
[]
[null,null,"Do you wish to use an optional threshold profile in the door area (in addition to the obligatory drip rail)?"]
[]
[]
[{"$nulls":3},"No"]
[]
[]
[null,null,"Do you wish to use the Aquant bulb seal?",null,"Yes"]
[]
[]
[null,null,"Do you wish to use the Aquant finger pull handle?",null,"Yes"]
[]
[]
[]
[null,{"$f":"Haftungsausschluss","v":"Willach assumes no liability for damage of any kind that could arise as a result of using this profile and glass dimensions calculator. (11.05.2016 Rev. 3)"}]
[]
[null,"System dimensions"]
[]
[null,null,"System dimensions specified/recommended by Willach",{"$nulls":4},"Deviations from system dimensions"]
[]
[null,null,"HSA","Höhenabzugsmaß für Aufnahme Schiebeflügel",30,"(mm)",null,"Deviation from system dimension?",{"$nulls":3},{"$f":"IF(OR(E1_HSA_Wunsch=\"\",E1_HSA_Wunsch=E1_HSA_System),\"Nein\",\"Ja\")","v":"Nein"},"Desired value",null,null,{"$f":"IF(OR(L67=\"Nein\",O67=\"\"),E67,O67)","v":30},"(mm)"]
[]
[null,null,"WSZ","Additional width of sliding sash for handle",69,"(mm)",null,"Deviation from system dimension?",{"$nulls":3},{"$f":"IF(OR(E1_WSZ_Wunsch=\"\",E1_WSZ_Wunsch=E1_WSZ_System),\"Nein\",\"Ja\")","v":"Nein"},"Desired value",null,null,{"$f":"IF(OR(L69=\"Nein\",O69=\"\"),E69,O69)","v":69},"(mm)"]
[]
[null,null,"WFA","Allowance for fixed sash for wall attachment",{"$f":"IF(E39=\"Profile\",14,3)","v":3},"(mm)",null,"Deviation from system dimension?",{"$nulls":3},{"$f":"IF(OR(E1_WFA_Wunsch=\"\",E1_WFA_Wunsch=E1_WFA_System),\"Nein\",\"Ja\")","v":"Nein"},"Desired value",null,null,{"$f":"IF(OR(L71=\"Nein\",O71=\"\"),E71,O71)","v":3},"(mm)"]
[]
[null,null,"HFA","Höhenabzugsmaß für Aufnahme Festflügel",42,"(mm)",null,"Deviation from system dimension?",{"$nulls":3},{"$f":"IF(OR(E1_HFA_Wunsch=\"\",E1_HFA_Wunsch=E1_HFA_System),\"Nein\",\"Ja\")","v":"Nein"},"Desired value",null,null,{"$f":"IF(OR(L73=\"Nein\",O73=\"\"),E73,O73)","v":42},"(mm)"]
[]
[null,null,"UF","Overlap between sliding sash and fixed sash",{"$f":"IF(E45=\"Yes\",5,35)","v":35},"(mm)",null,"Deviation from system dimension?",{"$nulls":3},{"$f":"IF(OR(E1_UF_Wunsch=\"\",E1_UF_Wunsch=E1_UF_System),\"Nein\",\"Ja\")","v":"Nein"},"Desired value",null,null,{"$f":"IF(OR(L75=\"Nein\",O75=\"\"),E75,O75)","v":35},"(mm)"]
[]
[null,null,"SMs","Size of gap on the closing side",14,"(mm)",null,"Deviation from system dimension?",{"$nulls":3},{"$f":"IF(OR(E1_SMs_Wunsch=\"\",E1_SMs_Wunsch=E1_SMs_System),\"Nein\",\"Ja\")","v":"Nein"},"Desired value",null,null,{"$f":"IF(OR(L77=\"Nein\",O77=\"\"),E77,O77)","v":14},"(mm)"]
[]
[null,null,"SMo","Vorgabe Mindest-Spaltmaß öffnungsseitig",{"$f":"IF($E$39=\"Profile\",40,20)","v":20},"(mm)",null,"Deviation from system dimension?",{"$nulls":3},{"$f":"IF(OR(E1_SMo_Wunsch=\"\",E1_SMo_Wunsch=E1_SMo_System),\"Nein\",\"Ja\")","v":"Nein"},"Desired value",null,null,{"$f":"IF(OR(L79=\"Nein\",O79=\"\"),E79,O79)","v":20},"(mm)"]
[]
[{"$nulls":3},"Weight of Aquant handle",0.2,"(kg)",null,"Deviation from system dimension?",{"$nulls":3},{"$f":"IF(OR(E1_Gewicht_Griff_Wunsch=\"\",E1_Gewicht_Griff_Wunsch=E1_Gewicht_Griff_System),\"Nein\",\"Ja\")","v":"Nein"},"Desired value",null,null,{"$f":"IF(OR(L81=\"Nein\",O81=\"\"),E81,O81)","v":0.2},"(kg)"]
[]
[{"$nulls":3},"Glasstärke",8,"(mm)"]
[]
[{"$nulls":3},"Eckenabzug",49,"(mm)"]
[]
[{"$nulls":3},"Glasscheibenabstand",15,"(mm)"]
[]
[null,null,{"$f":"IF(OR(L67=\"Ja\",L71=\"Ja\",L73=\"Ja\",L75=\"Ja\",L77=\"Ja\",L79=\"Ja\",L69=\"Ja\",L81=\"Ja\"),\"Caution: you are deviating from the suggested system dimension, please check whether the system can be built with the value you have selected!\",\"\")","v":""}]
[]
[]
[]
[null,"Automatic calculation of glass dimensions and profile lengths*",{"$nulls":5},"Automatic check of door sash width, sash weight, aspect ratio and gap dimension on the opening side"]
[]
[null,null,"Glass dimensions of sliding sash 1",{"$nulls":5},"Check of the door sash width"]
[]
[null,null,"WS1","Glass width of sliding sash 1 with handle",{"$f":"(E1_W1-E1_WFA_final-E1_WFZ1+E1_WSZ_final+E1_UF_final-E1_SMs_final-E1_Glasstärke)/2","v":481},"(mm)",null,null,"WS1","Glass width of sliding sash 1 with handle",null,{"$f":"E1_WS1","v":481},"≥",380,"(mm)",null,{"$f":"IF(L97>=N97,\"Yes\",\"No\")","v":"Yes"}]
[]
[null,null,"HS1","Glass height of sliding sash 1",{"$f":"E1_H-E1_HSA_final","v":{"v":1970,"d":"1,970"}},"(mm)",null,null,"Check of the sash weight"]
[]
[null,null,"Please note that drill holes are required, please refer to the relevant drilling drawings!",{"$nulls":6},"Weight of sliding sash 1",null,{"$f":"ROUND(E1_WS1/1000*E1_HS/1000*2.5*E1_Glasstärke+E1_Griff_final,0)","v":19},"≤",40,"(kg)",null,{"$f":"IF(L101<=N101,\"Yes\",\"No\")","v":"Yes"}]
[]
[{"$nulls":8},"Check of the aspect ratio"]
[null,null,"Glass dimensions of fixed sash 1"]
[{"$nulls":9},"Height-to-width ratio of sliding sash 1",null,{"$f":"ROUND(E1_HS/E1_WS1,2)","v":{"v":4.1,"d":"4.10"}},"≤",5,null,null,{"$f":"IF(L105<=N105,\"Yes\",\"No\")","v":"Yes"}]
[null,null,"WF1","Glass width of fixed sash 1",{"$f":"E1_WS1-E1_WSZ_final+E1_WFZ1","v":429},"(mm)"]
[]
[null,null,"HF1","Glass height of fixed sash 1",{"$f":"E1_H-E1_HFA_final","v":{"v":1958,"d":"1,958"}},"(mm)",null,null,"Check of the gap dimension on the opening side"]
[]
[null,null,"Glass dimensions of fixed sash 2",{"$nulls":5},{"$f":"C79&1","v":"SMo1"}," Gap dimension on the opening side for sliding sash 1",null,{"$f":"E1_WFZ1+E1_WFA_final","v":20},"≥",{"$f":"P79","v":20},"(mm)",null,{"$f":"IF(L110>=N110,\"Yes\",\"No\")","v":"Yes"}]
[{"$nulls":8},{"$f":"IF(Q110=\"No\",\"Note: if the gap on the opening side is too small , please increase WFZ1.\",\"\")","v":""}]
[null,null,"WF2","Glass width of fixed sash 2",{"$f":"E1_W2-E1_WFA_final","v":897},"(mm)"]
[{"$nulls":8},{"$f":"IF(OR(Q97=\"No\",Q101=\"No\",Q105=\"No\",Q110=\"No\",),\"Caution: the technical restrictions have not been observed; please change your planning!\",\"\")","v":""}]
[null,null,"HF2","Glass height of fixed sash 2",{"$f":"E1_HF","v":{"v":1958,"d":"1,958"}},"(mm)"]
[]
[null,null,"Length of track profile/cover profile 1"]
[]
[null,null,"LS1","Length of track profile/cover profile 1",{"$f":"E1_W1-E1_Eckstück","v":851},"(mm)"]
[]
[null,null,"Length of track profile/cover profile 2"]
[]
[null,null,"LS2","Length of track profile/cover profile 2",{"$f":"E1_W2-E1_Eckstück","v":851},"(mm)"]
[]
[null,null,"For information: clearance with open door"]
[]
[null,null,"LWt","Clearance with open door",{"$f":"E1_W1-E1_WFA_final-E1_WF1-E1_WSZ_final-E1_Glasstärke","v":391},"(mm)"]
[]
[]
[null,"Willach assumes no liability for damage of any kind that could arise as a result of using this profile and glass dimensions calculator. (11.05.2016 Rev. 3)"]
[]
[null,"Order list"]
[]
[null,null,"Profile sets"]
[]
[null,null,"Description",null,"Article number",{"$nulls":3},"Quantity","Unit","Sales length","Cut length*"]
[null,null,"Profile set for side 1",null,{"$f":"IF(K136<1000,\"612 070.0\"&K136&\".111\",\"612 070.\"&K136&\".111\")","v":"612 070.0950.111"},{"$nulls":3},1,"piece",{"$f":"VLOOKUP(L136,$E$217:$I$221,2,TRUE)","v":{"v":950,"d":"950 mm"}},{"$f":"E118","v":{"v":851,"d":"851 mm"}}]
[null,null,"Profile set for side 2",null,{"$f":"IF(K137<1000,\"612 070.0\"&K137&\".111\",\"612 070.\"&K137&\".111\")","v":"612 070.0950.111"},{"$nulls":3},1,"piece",{"$f":"VLOOKUP(L137,$E$217:$I$221,2,TRUE)","v":{"v":950,"d":"950 mm"}},{"$f":"E122","v":{"v":851,"d":"851 mm"}}]
[]
[]
[null,null,"Accessory kits"]
[]
[null,null,"Description",null,"Article number",{"$nulls":3},"Quantity","Unit"]
[null,null,"Accessory kit door sash 20 kg",null,"612 002.0000.000",{"$nulls":3},{"$f":"IF(E1_Flügelgewicht_1<=20,1,0)","v":1},"piece"]
[null,null,"Accessory kit door sash 40 kg",null,"612 004.0000.000",{"$nulls":3},{"$f":"IF(E1_Flügelgewicht_1>20,1,0)","v":0},"piece"]
[null,null,"Accessory kit installation",null,"612 010.0000.000",{"$nulls":3},1,"piece"]
[null,null,"Accessory kit corner bracket",null,"612 020.0000.000",{"$nulls":3},1,"piece"]
[]
[null,null,"Sealing strips (optional, please see above to select or deselect)"]
[]
[null,null,"Description",null,"Article number",{"$nulls":3},"Quantity","Unit","Sales length","Cut length*"]
[null,null,"Bulb seal",null,{"$f":"\"612 410.\"&K151&\".305\"","v":"612 410.2000.305"},{"$nulls":3},{"$f":"IF(E1_Wahl_Dichtl_schließseitig=\"Yes\",1,0)","v":1},"piece",{"$f":"VLOOKUP(L151,$E$223:$I$224,2,TRUE)","v":{"v":2000,"d":"2,000 mm"}},{"$f":"E1_HS","v":{"v":1970,"d":"1,970 mm"}}]
[null,null,"Vertical sealing strips between fixed and sliding sash",null,{"$f":"\"612 440.\"&K152&\".305\"","v":"612 440.2000.305"},{"$nulls":3},{"$f":"IF(E1_Wahl_Dichtl_F_u_S=\"Yes\",1,0)","v":0},"pair",{"$f":"VLOOKUP(L152,$E$223:$I$224,2,TRUE)","v":{"v":2000,"d":"2,000 mm"}},{"$f":"E1_HF-24","v":{"v":1934,"d":"1,934 mm"}}]
[]
[null,null,"Threshold profile (optional, please see above to select or deselect)"]
[]
[null,null,"Description",null,"Article number",{"$nulls":3},"Quantity","Unit","Sales length","Cut length*"]
[null,null,"Threshold profile, cut straight, gloss-polished aluminium",null,"612 450.1000.111",{"$nulls":3},{"$f":"IF(E1_Wahl_Schwallschutz=\"Yes, made of gloss-polished aluminium\",1,0)","v":0},"piece","1000 mm",{"$f":"E1_LWt+E1_WSZ_final","v":{"v":460,"d":"460 mm"}}]
[null,null,"Threshold profile, cut straight, transparent plastic",null,"612 450.1000.305",{"$nulls":3},{"$f":"IF(E1_Wahl_Schwallschutz=\"Yes, made of transparent plastic\",1,0)","v":0},"piece","1000 mm",{"$f":"E1_LWt+E1_WSZ_final","v":{"v":460,"d":"460 mm"}}]
[]
[null,null,"Wall profile (optional, please see above to select or deselect)"]
[]
[null,null,"Description",null,"Article number",{"$nulls":3},"Quantity","Unit","Sales length","Cut length*"]
[null,null,"Wall profile incl. plastic insert",null,{"$f":"\"612 520.\"&K163&\".111\"","v":"612 520.2000.111"},{"$nulls":3},{"$f":"IF(E1_Wahl_Wandanschluss=\"Profile\",2,0)","v":0},"piece",{"$f":"VLOOKUP(L163,$E$223:$I$224,2,TRUE)","v":{"v":2000,"d":"2,000 mm"}},{"$f":"E1_H-50","v":{"v":1950,"d":"1,950 mm"}}]
[]
[null,null,"Floor profile (optional, please see above to select or deselect)"]
[]
[null,null,"Description",null,"Article number",{"$nulls":3},"Quantity","Unit","Sales length"]
[null,null,"Floor profile length 1000 mm",null,{"$f":"\"612 530.\"&K168&\".111\"","v":"612 530.1000.111"},{"$nulls":3},{"$f":"IF(E1_Wahl_Bodenprofil=\"Yes\",L182,0)","v":0},"piece",{"v":1000,"d":"1,000 mm"}]
[null,null,"Floor profile length 1500 mm",null,{"$f":"\"612 530.\"&K169&\".111\"","v":"612 530.1500.111"},{"$nulls":3},{"$f":"IF(E1_Wahl_Bodenprofil=\"Yes\",M182,0)","v":0},"piece",{"v":1500,"d":"1,500 mm"}]
[]
[null,null,"Description",null,"Glass width of fixed sashes"]
[null,null,"Approximate required length of floor profile for fixed sash 1",null,{"$f":"E1_WF1","v":{"v":429,"d":"429 mm"}}]
[null,null,"Approximate required length of floor profile for fixed sash 2",null,{"$f":"E1_WF2","v":{"v":897,"d":"897 mm"}}]
[null,null,"Approximate required total length of floor profile",null,{"$f":"SUM(E172:H173)","v":{"v":1326,"d":"1,326 mm"}}]
[]
[null,null,"Kaufvarianten"]
[]
[{"$nulls":11},"Im Minimum-Fall"]
[null,null,"Zusammenfassung",{"$nulls":5},"Preis Summe","Mögl.?","Minimum und möglich?","Anzahl 1000 mm","Anzahl 1500 mm"]
[null,null,{"$f":"C184","v":"Variante 1: Alle einzeln"},{"$nulls":5},{"$f":"IF(J180=\"Ja\",M187,\"n.a.\")","v":{"v":64.44,"d":"64"}},{"$f":"E195","v":"Ja"},{"$f":"IF(AND(I180=MIN($I$180:$I$181),J180=\"Ja\"),\"Ja\",\"Nein\")","v":"Nein"},{"$f":"IF(K180=\"Ja\",I185,0)","v":0},{"$f":"IF(K180=\"Ja\",I186,0)","v":0}]
[null,null,{"$f":"C197","v":"Variante 2: Alle zusammen"},{"$nulls":5},{"$f":"IF(J181=\"Ja\",M200,\"n.a.\")","v":{"v":48.33,"d":"48"}},{"$f":"E208","v":"Ja"},{"$f":"IF(AND(I181=MIN($I$180:$I$181),J181=\"Ja\"),\"Ja\",\"Nein\")","v":"Ja"},{"$f":"IF(K181=\"Ja\",I198,0)","v":0},{"$f":"IF(K181=\"Ja\",I199,0)","v":1}]
[{"$nulls":11},{"$f":"SUM(L180:L181)","v":0},{"$f":"SUM(M180:M181)","v":1}]
[]
[null,null,"Variante 1: Alle einzeln",null,"Artikelnummer",{"$nulls":3},"Anzahl","Einheit","Verkaufslänge","Brutto-VK-Preis","Summe Brutto-VK-Preis"]
[null,null,"Anzahl benötigter Bodenprofile in Länge 1000 mm",null,{"$f":"\"612 XXX.\"&K185&\".111\"","v":"612 XXX.1000.111"},{"$nulls":3},{"$f":"COUNTIF(H190:I$200,K185)","v":2},"Stück",{"v":1000,"d":"1,000 mm"},{"$f":"F229","v":{"v":32.22,"d":"32.22 €"}},{"$f":"I185*L185","v":{"v":64.44,"d":"64.44 €"}}]
[null,null,"Anzahl benötigter Bodenprofile in Länge 1500 mm",null,{"$f":"\"612 XXX.\"&K186&\".111\"","v":"612 XXX.1500.111"},{"$nulls":3},{"$f":"COUNTIF(H190:I192,K186)","v":0},"Stück",{"v":1500,"d":"1,500 mm"},{"$f":"F230","v":{"v":48.33,"d":"48.33 €"}},{"$f":"I186*L186","v":0}]
[{"$nulls":12},{"$f":"M185+M186","v":{"v":64.44,"d":"64.44 €"}}]
[]
[{"$nulls":4},"Länge ben.",{"$nulls":3},"Verkaufslänge"]
[null,null,{"$f":"C172","v":"Approximate required length of floor profile for fixed sash 1"},null,{"$f":"E172","v":{"v":429,"d":"429 mm"}},{"$nulls":3},{"$f":"IF(E190<=1500,VLOOKUP(E190,$E$226:$I$227,2,TRUE),\"nicht vorhanden\")","v":{"v":1000,"d":"1,000 mm"}}]
[null,null,{"$f":"C173","v":"Approximate required length of floor profile for fixed sash 2"},null,{"$f":"E173","v":{"v":897,"d":"897 mm"}},{"$nulls":3},{"$f":"IF(E191<=1500,VLOOKUP(E191,$E$226:$I$227,2,TRUE),\"nicht vorhanden\")","v":{"v":1000,"d":"1,000 mm"}}]
[]
[null,null,"Summe",null,{"$f":"SUM(E190:F192)","v":{"v":1326,"d":"1,326 mm"}}]
[]
[null,null,"Ist die Variante eine mögliche Lösung?",null,{"$f":"IF(OR(I190=\"nicht vorhanden\",I191=\"nicht vorhanden\",I192=\"nicht vorhanden\"),\"Nein\",\"Ja\")","v":"Ja"}]
[]
[null,null,"Variante 2: Alle zusammen",null,"Artikelnummer",{"$nulls":3},"Anzahl","Einheit","Verkaufslänge","Brutto-VK-Preis","Summe Brutto-VK-Preis"]
[null,null,"Anzahl benötigter Bodenprofile in Länge 1000 mm",null,{"$f":"\"612 XXX.\"&K198&\".111\"","v":"612 XXX.1000.111"},{"$nulls":3},{"$f":"COUNTIF(H$200:I203,K198)","v":0},"Stück",{"v":1000,"d":"1,000 mm"},{"$f":"F229","v":{"v":32.22,"d":"32.22 €"}},{"$f":"I198*L198","v":0}]
[null,null,"Anzahl benötigter Bodenprofile in Länge 1500 mm",null,{"$f":"\"612 XXX.\"&K199&\".111\"","v":"612 XXX.1500.111"},{"$nulls":3},{"$f":"COUNTIF(H203:I205,K199)","v":1},"Stück",{"v":1500,"d":"1,500 mm"},{"$f":"F230","v":{"v":48.33,"d":"48.33 €"}},{"$f":"I199*L199","v":{"v":48.33,"d":"48.33 €"}}]
[{"$nulls":12},{"$f":"M198+M199","v":{"v":48.33,"d":"48.33 €"}}]
[]
[{"$nulls":4},"Länge ben.",{"$nulls":3},"Verkaufslänge"]
[null,null,"Ungefähr benötigte Länge an Bodenprofil für alle zusammen",null,{"$f":"E174","v":{"v":1326,"d":"1,326 mm"}},{"$nulls":3},{"$f":"IF(E203<=1500,VLOOKUP(E203,$E$226:$I$227,2,TRUE),\"nicht vorhanden\")","v":{"v":1500,"d":"1,500 mm"}}]
[]
[]
[null,null,"Summe",null,{"$f":"SUM(E203:F205)","v":{"v":1326,"d":"1,326 mm"}}]
[]
[null,null,"Ist die Variante eine mögliche Lösung?",null,{"$f":"IF(OR(I203=\"nicht vorhanden\",I204=\"nicht vorhanden\",I205=\"nicht vorhanden\"),\"Nein\",\"Ja\")","v":"Ja"}]
[]
[null,null,"Finger pull handle (optional, please see above to select or deselect)"]
[]
[null,null,"Description",null,"Article number",{"$nulls":3},"Quantity","Unit",{"$nulls":3},"* With exactly vertical walls and horizontal floors."]
[null,null,"Round finger pull handle, diameter 39 mm (diameter of glass drill hole 10 mm), 1 pair for 1 sash (inside and outside), stainless steel",null,"612 267.0000.020",{"$nulls":3},{"$f":"IF(E1_Wahl_Griff=\"Yes\",1,0)","v":1},"pair"]
[]
[]
[null,null,"Tabelle Profillängen"]
[{"$nulls":3},"Laufschiene/Blende",0,950,null,null,950,null,"mm"]
[{"$nulls":4},950.01,1150,null,null,1150,null,"mm"]
[{"$nulls":4},1150.01,1550,null,null,1550,null,"mm"]
[{"$nulls":4},1550.01,2050,null,null,2050,null,"mm"]
[{"$nulls":4},2050.01,4880,null,null,4880,null,"mm"]
[]
[{"$nulls":3},"Wandprofil/Dichtleisten",0,2000,null,null,2000,null,"mm"]
[{"$nulls":4},2000.01,2490,null,null,2490,null,"mm"]
[]
[{"$nulls":3},"Bodenprofil",0,1000,null,null,1000,null,"mm"]
[{"$nulls":4},1000.01,1500,null,null,1500,null,"mm"]
[]
[{"$nulls":3},"Brutto-VK-Bodenprofil",1000,32.22]
[{"$nulls":4},1500,48.33]
[]
[null,{"$f":"Haftungsausschluss","v":"Willach assumes no liability for damage of any kind that could arise as a result of using this profile and glass dimensions calculator. (11.05.2016 Rev. 3)"}]

{"sheet":"corner_2_sashes_corner entry","index":2,"n_rows":241,"n_cols":17,"rows_kept":241,"merged":[[0,1,0,14],[3,1,3,17],[4,1,26,17],[28,1,28,5],[28,7,28,17],[29,8,60,11],[29,12,29,17],[30,12,30,17],[31,12,31,17],[32,12,32,17],[33,12,33,17],[34,12,34,17],[35,12,35,17],[36,12,36,17],[37,12,37,17],[38,12,38,17],[39,12,39,17],[40,2,41,3],[40,4,41,4],[40,12,60,17],[43,2,44,3],[43,4,44,4],[46,2,47,3],[46,4,47,4],[49,2,50,3],[52,3,52,4],[55,2,56,3],[55,4,56,4],[58,2,59,3],[58,4,59,4],[62,1,62,16],[64,1,64,17],[66,2,66,5],[66,7,66,16],[68,7,68,10],[70,7,70,10],[72,7,72,10],[74,7,74,10],[76,7,76,10],[78,7,78,10],[80,7,80,10],[82,7,82,10],[90,2,91,16],[94,1,94,5],[94,7,94,17],[96,8,96,16],[98,9,98,10],[100,9,100,10],[102,2,103,4],[102,8,102,16],[104,9,104,10],[105,2,105,4],[110,8,111,8],[110,9,111,10],[110,11,111,11],[110,12,111,12],[110,13,111,13],[110,16,111,16],[111,2,112,4],[113,8,114,8],[113,9,114,10],[113,11,114,11],[113,12,114,12],[113,13,114,13],[113,16,114,16],[114,2,114,4],[118,9,118,10],[119,9,119,10],[120,2,120,4],[120,8,121,16],[123,8,125,16],[126,2,126,4],[130,2,130,4],[134,2,134,4],[139,1,139,16],[141,1,141,17],[143,2,143,3],[145,2,145,3],[145,4,145,7],[145,11,145,12],[146,2,146,3],[146,4,146,7],[146,11,146,12],[147,2,147,3],[147,4,147,7],[147,11,147,12],[148,4,148,7],[148,11,149,12],[149,2,149,3],[151,2,151,3],[151,4,151,7],[151,11,151,12],[152,2,152,3],[152,4,152,7],[153,2,153,3],[153,4,153,7],[154,2,154,3],[154,4,154,7],[155,2,155,3],[155,4,155,7],[157,2,157,12],[159,2,159,3],[159,4,159,7],[159,11,159,12],[160,2,160,3],[160,4,160,7],[160,11,160,12],[161,2,161,3],[161,4,161,7],[161,11,161,12],[163,2,163,12],[165,2,165,3],[165,4,165,7],[165,11,165,12],[166,2,166,3],[166,4,166,7],[167,2,167,3],[167,4,167,7],[168,2,168,3],[168,4,168,7],[168,11,168,12],[169,2,169,12],[171,2,171,3],[171,4,171,7],[171,11,171,12],[172,2,172,3],[172,4,172,7],[172,11,172,12],[174,2,174,12],[176,2,176,3],[176,4,176,7],[177,2,177,3],[177,4,177,7],[178,2,178,3],[178,4,178,7],[180,2,180,3],[180,4,180,7],[180,11,180,12],[181,2,181,3],[181,4,181,7],[181,11,181,12],[182,2,182,3],[182,4,182,7],[183,2,183,3],[183,4,183,7],[185,2,185,3],[187,11,187,12],[188,2,188,3],[188,5,188,7],[189,2,189,3],[190,2,190,3],[192,2,192,3],[193,2,193,3],[193,4,193,7],[194,2,194,3],[194,4,194,7],[195,2,195,3],[195,4,195,7],[198,4,198,5],[198,8,198,9],[199,2,199,3],[199,4,199,5],[199,8,199,9],[200,2,200,3],[200,4,200,5],[200,8,200,9],[201,2,201,3],[201,4,201,5],[201,8,201,9],[202,2,202,3],[202,4,202,5],[203,8,203,9],[204,2,204,3],[204,8,204,9],[206,2,206,3],[206,4,206,7],[207,2,207,3],[207,4,207,7],[208,2,208,3],[208,4,208,7],[211,4,211,5],[211,8,211,9],[212,2,212,3],[212,4,212,5],[212,8,212,9],[213,2,214,3],[213,4,213,5],[213,8,213,9],[214,4,214,5],[214,8,214,9],[215,2,215,3],[215,4,215,5],[217,2,217,3],[219,2,219,3],[221,2,221,3],[221,4,221,7],[221,13,222,16],[222,2,222,3],[222,4,222,7],[225,2,225,16],[240,1,240,16]]}
[null,"Aquant 40: corner shower with 2 sliding sashes and corner entry"]
[]
[]
[null,{"$f":"corner_1_sash!B4","v":"Drawings"}]
{"$rows_empty":24}
[null,{"$f":"corner_1_sash!B29","v":"User input"},{"$nulls":5},{"$f":"corner_1_sash!H29","v":"Legend & Formulas"}]
[{"$nulls":8},"Legend\nW1 = System width of side 1\nW2 = System width of side 2\nH = System height\nLS1 = Length of track profile/cover profile 1\nLS2 = Length of track profile/cover profile 2\nLWt = Clearance with open doors\n\nWS1 = Glass width of sliding sash 1 with handle\nWS2 = Glass width of sliding sash 2 with handle\nWSZ = Additional width of sliding sash for handle\nHS1 = Glass height of sliding sash 1\nHS2 = Glass height of sliding sash 2\n\nWF1 = Glass width of fixed sash 1\nWF2 = Glass width of fixed sash 2\nWFA = Allowance for fixed sash for wall attachment\nWFZ1 = Additional width of fixed sash 1\nWFZ2 = Additional width of fixed sash 2\nHF1 = Glass height of fixed sash 1\nHF2 = Glass height of fixed sash 2\n\nUF = Overlap between sliding sash and fixed sash\n\nSMs = Size of gap on the closing side\nSMo1 = Size of gap on the opening side for sliding sash 1\nSMo2 = Size of gap on the opening side for sliding sash 2\n",{"$nulls":3},"Formulas"]
[null,null,"W1","System width of side 1 (max. 1,500 mm)",900,"(mm)",{"$nulls":6},{"$f":"\"WS1 = (W1 - SMs - WFA - WFZ1 + UF + WSZ - \"&E2_Glasstärke&\") / 2\"","v":"WS1 = (W1 - SMs - WFA - WFZ1 + UF + WSZ - 8) / 2"}]
[{"$nulls":12},"WF1 = WS1 - WSZ + WFZ1"]
[null,null,"W2","System width of side 2 (max. 1,500 mm)",900,"(mm)",{"$nulls":6},{"$f":"\"WS2 = (W2 - SMs - WFA - WFZ2 + UF + WSZ - \"&E2_Glasstärke&\") / 2\"","v":"WS2 = (W2 - SMs - WFA - WFZ2 + UF + WSZ - 8) / 2"}]
[{"$nulls":12},"WF2 = WS2 - WSZ + WFZ2"]
[null,null,"H","System height (max. 2,500 mm)",{"v":2000,"d":"2,000"},"(mm)",{"$nulls":6},{"$f":"\"HS1 = HS2 = H - \"&E2_HSA_System","v":"HS1 = HS2 = H - 30"}]
[{"$nulls":12},{"$f":"\"HF1 = HF2 = H - \"&E2_HFA_System","v":"HF1 = HF2 = H - 42"}]
[null,null,"WFZ1","Additional width of fixed sash 1",17,"(mm)",{"$nulls":6},"SMo1 = WFZ1 + WFA"]
[{"$nulls":12},"SMo2 = WFZ2 + WFA"]
[null,null,"WFZ2","Additional width of fixed sash 2",17,"(mm)",{"$nulls":6},{"$f":"\"LS1 = W1 - \"&E2_Eckenabzug","v":"LS1 = W1 - 49"}]
[{"$nulls":12},{"$f":"\"LS2 = W2 - \"&E2_Eckenabzug","v":"LS2 = W2 - 49"}]
[null,null,"Do you wish to attach the fixed sash to the wall via a wall profile or directly via silicon?",null,"Silicon",{"$nulls":7},"\n"]
[]
[]
[null,null,"Do you wish to use the Aquant floor profile?",null,"No"]
[]
[]
[null,null,"Do you wish to use vertical sealing strips between fixed and sliding sash?",null,"No"]
[]
[]
[null,null,"Do you wish to use an optional threshold profile in the door area (in addition to the obligatory drip rail)?"]
[]
[]
[{"$nulls":3},"No"]
[]
[]
[null,null,"Do you wish to use the Aquant magnetic seals 90°?",null,"Yes"]
[]
[]
[null,null,"Do you wish to use the Aquant finger pull handle?",null,"Yes"]
[]
[]
[]
[null,{"$f":"Haftungsausschluss","v":"Willach assumes no liability for damage of any kind that could arise as a result of using this profile and glass dimensions calculator. (11.05.2016 Rev. 3)"}]
[]
[null,{"$f":"corner_1_sash!B63","v":"System dimensions"}]
[]
[null,null,{"$f":"corner_1_sash!C65","v":"System dimensions specified/recommended by Willach"},{"$nulls":4},{"$f":"corner_1_sash!H65","v":"Deviations from system dimensions"}]
[]
[null,null,"HSA",{"$f":"corner_1_sash!D67","v":"Höhenabzugsmaß für Aufnahme Schiebeflügel"},30,"(mm)",null,{"$f":"corner_1_sash!H67","v":"Deviation from system dimension?"},{"$nulls":3},{"$f":"IF(OR(E2_HSA_Wunsch=\"\",E2_HSA_Wunsch=E2_HSA_System),\"Nein\",\"Ja\")","v":"Nein"},{"$f":"corner_1_sash!M67","v":"Desired value"},null,null,{"$f":"IF(OR(L69=\"Nein\",O69=\"\"),E69,O69)","v":30},"(mm)"]
[]
[null,null,"WSZ",{"$f":"corner_1_sash!D69","v":"Additional width of sliding sash for handle"},69,"(mm)",null,{"$f":"corner_1_sash!H69","v":"Deviation from system dimension?"},{"$nulls":3},{"$f":"IF(OR(E2_WSZ_Wunsch=\"\",E2_WSZ_Wunsch=E2_WSZ_System),\"Nein\",\"Ja\")","v":"Nein"},{"$f":"corner_1_sash!M69","v":"Desired value"},null,null,{"$f":"IF(OR(L71=\"Nein\",O71=\"\"),E71,O71)","v":69},"(mm)"]
[]
[null,null,"WFA",{"$f":"corner_1_sash!D71","v":"Allowance for fixed sash for wall attachment"},{"$f":"IF(E41=\"Profile\",14,3)","v":3},"(mm)",null,{"$f":"H71","v":"Deviation from system dimension?"},{"$nulls":3},{"$f":"IF(OR(E2_WFA_Wunsch=\"\",E2_WFA_Wunsch=E2_WFA_System),\"Nein\",\"Ja\")","v":"Nein"},{"$f":"M71","v":"Desired value"},null,null,{"$f":"IF(OR(L73=\"Nein\",O73=\"\"),E73,O73)","v":3},"(mm)"]
[]
[null,null,"HFA",{"$f":"corner_1_sash!D73","v":"Höhenabzugsmaß für Aufnahme Festflügel"},42,"(mm)",null,{"$f":"corner_1_sash!H73","v":"Deviation from system dimension?"},{"$nulls":3},{"$f":"IF(OR(E2_HFA_Wunsch=\"\",E2_HFA_Wunsch=E2_HFA_System),\"Nein\",\"Ja\")","v":"Nein"},{"$f":"corner_1_sash!M73","v":"Desired value"},null,null,{"$f":"IF(OR(L75=\"Nein\",O75=\"\"),E75,O75)","v":42},"(mm)"]
[]
[null,null,"UF",{"$f":"corner_1_sash!D75","v":"Overlap between sliding sash and fixed sash"},{"$f":"IF(E47=\"Yes\",5,35)","v":35},"(mm)",null,{"$f":"H71","v":"Deviation from system dimension?"},{"$nulls":3},{"$f":"IF(OR(E2_UF_Wunsch=\"\",E2_UF_Wunsch=E2_UF_System),\"Nein\",\"Ja\")","v":"Nein"},{"$f":"M71","v":"Desired value"},null,null,{"$f":"IF(OR(L77=\"Nein\",O77=\"\"),E77,O77)","v":35},"(mm)"]
[]
[null,null,"SMs",{"$f":"corner_1_sash!D77","v":"Size of gap on the closing side"},31,"(mm)",null,{"$f":"H71","v":"Deviation from system dimension?"},{"$nulls":3},{"$f":"IF(OR(E2_SMs_Wunsch=\"\",E2_SMs_Wunsch=E2_SMs_System),\"Nein\",\"Ja\")","v":"Nein"},{"$f":"M71","v":"Desired value"},null,null,{"$f":"IF(OR(L79=\"Nein\",O79=\"\"),E79,O79)","v":31},"(mm)"]
[]
[null,null,"SMo",{"$f":"corner_1_sash!D79","v":"Vorgabe Mindest-Spaltmaß öffnungsseitig"},{"$f":"IF($E$41=\"Profile\",40,20)","v":20},"(mm)",null,{"$f":"corner_1_sash!H79","v":"Deviation from system dimension?"},{"$nulls":3},{"$f":"IF(OR(E2_SMo_Wunsch=\"\",E2_SMo_Wunsch=E2_SMo_System),\"Nein\",\"Ja\")","v":"Nein"},{"$f":"corner_1_sash!M79","v":"Desired value"},null,null,{"$f":"IF(OR(L81=\"Nein\",O81=\"\"),E81,O81)","v":20},"(mm)"]
[]
[{"$nulls":3},{"$f":"corner_1_sash!D81","v":"Weight of Aquant handle"},0.2,"(kg)",null,{"$f":"H71","v":"Deviation from system dimension?"},{"$nulls":3},{"$f":"IF(OR(E2_Gewicht_Griff_Wunsch=\"\",E2_Gewicht_Griff_Wunsch=E2_Gewicht_Griff),\"Nein\",\"Ja\")","v":"Nein"},{"$f":"M71","v":"Desired value"},null,null,{"$f":"IF(OR(L83=\"Nein\",O83=\"\"),E83,O83)","v":0.2},"(kg)"]
[]
[{"$nulls":3},"Glasstärke",8,"(mm)"]
[]
[{"$nulls":3},"Eckenabzug",49,"(mm)"]
[]
[{"$nulls":3},"Glasscheibenabstand",15,"(mm)"]
[]
[null,null,{"$f":"IF(OR(L69=\"Ja\",L73=\"Ja\",L75=\"Ja\",L77=\"Ja\",L79=\"Ja\",L81=\"Ja\",L71=\"Ja\",L83=\"Ja\"),\"Caution: you are deviating from the suggested system dimension, please check whether the system can be built with the value you have selected!\",\"\")","v":""}]
[]
[]
[]
[null,{"$f":"corner_1_sash!B93","v":"Automatic calculation of glass dimensions and profile lengths*"},{"$nulls":5},{"$f":"corner_1_sash!H93","v":"Automatic check of door sash width, sash weight, aspect ratio and gap dimension on the opening side"}]
[]
[null,null,"Glass dimensions of sliding sash 1",{"$nulls":5},{"$f":"corner_1_sash!I95","v":"Check of the door sash width"}]
[]
[null,null,"WS1","Glass width of sliding sash 1 with handle",{"$f":"(E2_W1-E2_SMs_final-E2_WFA_final-E2_WFZ1+E2_UF_final+E2_WSZ_final-E2_Glasstärke)/2","v":{"v":472.5,"d":"473"}},"(mm)",null,null,{"$f":"C99","v":"WS1"},{"$f":"D99","v":"Glass width of sliding sash 1 with handle"},null,{"$f":"E2_WS1","v":{"v":472.5,"d":"473"}},"≥",380,"(mm)",null,{"$f":"IF(L99>=N99,\"Yes\",\"No\")","v":"Yes"}]
[]
[null,null,"HS1","Glass height of sliding sash 1",{"$f":"E2_H-E2_HSA_final","v":{"v":1970,"d":"1,970"}},"(mm)",null,null,{"$f":"C108","v":"WS2"},{"$f":"D108","v":"Glass width of sliding sash 2 with handle"},null,{"$f":"E2_WS2","v":{"v":472.5,"d":"473"}},"≥",380,"(mm)",null,{"$f":"IF(L101>=N101,\"Yes\",\"No\")","v":"Yes"}]
[]
[null,null,{"$f":"corner_1_sash!$C$101","v":"Please note that drill holes are required, please refer to the relevant drilling drawings!"},{"$nulls":5},{"$f":"corner_1_sash!I99","v":"Check of the sash weight"}]
[]
[{"$nulls":9},"Weight of sliding sash 1",null,{"$f":"ROUND(E2_WS1/1000*E2_HS/1000*2.5*E2_Glasstärke+E2_Gewicht_Griff_final,0)","v":19},"≤",40,"(kg)",null,{"$f":"IF(L105<=N105,\"Yes\",\"No\")","v":"Yes"}]
[null,null,"Glass dimensions of sliding sash 2"]
[{"$nulls":9},"Weight of sliding sash 2",null,{"$f":"ROUND(E2_WS2/1000*E2_HS/1000*2.5*E2_Glasstärke+E2_Gewicht_Griff_final,0)","v":19},"≤",40,"(kg)",null,{"$f":"IF(OR(L107<N107,L107=N107),\"Yes\",\"No\")","v":"Yes"}]
[null,null,"WS2","Glass width of sliding sash 2 with handle",{"$f":"(E2_W2-E2_SMs_final-E2_WFA_final-E2_WFZ2+E2_UF_final+E2_WSZ_final-E2_Glasstärke)/2","v":{"v":472.5,"d":"473"}},"(mm)"]
[{"$nulls":8},{"$f":"corner_1_sash!I103","v":"Check of the aspect ratio"}]
[null,null,"HS2","Glass height of sliding sash 2",{"$f":"E2_HS","v":{"v":1970,"d":"1,970"}},"(mm)"]
[{"$nulls":9},"Height-to-width ratio of sliding sash 1",null,{"$f":"ROUND(E2_HS/E2_WS1,2)","v":4.17},"≤",5,null,null,{"$f":"IF(L111<=N111,\"Yes\",\"No\")","v":"Yes"}]
[null,null,{"$f":"corner_1_sash!$C$101","v":"Please note that drill holes are required, please refer to the relevant drilling drawings!"}]
[]
[{"$nulls":9},"Height-to-width ratio of sliding sash 2",null,{"$f":"ROUND(E110/E2_WS2,2)","v":4.17},"≤",5,null,null,{"$f":"IF(L114<=N114,\"Yes\",\"No\")","v":"Yes"}]
[null,null,"Glass dimensions of fixed sash 1"]
[]
[null,null,"WF1","Glass width of fixed sash 1",{"$f":"E2_WS1-E2_WSZ_final+E2_WFZ1","v":{"v":420.5,"d":"421"}},"(mm)",null,null,{"$f":"corner_1_sash!I108","v":"Check of the gap dimension on the opening side"}]
[]
[null,null,"HF1","Glass height of fixed sash 1",{"$f":"E2_H-E2_HFA_final","v":{"v":1958,"d":"1,958"}},"(mm)",null,null,{"$f":"C81&1","v":"SMo1"}," Gap dimension on the opening side for sliding sash 1",null,{"$f":"E2_WFZ1+E2_WFA_final","v":20},"≥",{"$f":"P81","v":20},"(mm)",null,{"$f":"IF(L119>=N119,\"Yes\",\"No\")","v":"Yes"}]
[{"$nulls":8},{"$f":"C81&2","v":"SMo2"}," Gap dimension on the opening side for sliding sash 2",null,{"$f":"E2_WFZ2+E2_WFA_final","v":20},"≥",{"$f":"N119","v":20},"(mm)",null,{"$f":"IF(L120>=N120,\"Yes\",\"No\")","v":"Yes"}]
[null,null,"Glass dimensions of fixed sash 2",{"$nulls":5},{"$f":"IF(OR(Q119=\"No\",Q120=\"No\"),\"Note: if the gap on the opening side is too small , please increase WFZ1 or WFZ2.\",\"\")","v":""}]
[]
[null,null,"WF2","Glass width of fixed sash 2",{"$f":"E2_WS2+E2_WFZ2-E2_WSZ_final","v":{"v":420.5,"d":"421"}},"(mm)"]
[{"$nulls":8},{"$f":"IF(OR(Q99=\"No\",Q101=\"No\",Q105=\"No\",Q107=\"No\",Q111=\"No\",Q114=\"No\",Q119=\"No\",Q120=\"No\"),\"Caution: the technical restrictions have not been observed; please change your planning!\",\"\")","v":""}]
[null,null,"HF2","Glass height of fixed sash 2",{"$f":"E2_HF","v":{"v":1958,"d":"1,958"}},"(mm)"]
[]
[null,null,"Length of track profile/cover profile 1"]
[]
[null,null,"LS1","Length of track profile/cover profile 1",{"$f":"E2_W1-E2_Eckenabzug","v":851},"(mm)"]
[]
[null,null,"Length of track profile/cover profile 2"]
[]
[null,null,"LS2","Length of track profile/cover profile 2",{"$f":"E2_W2-E2_Eckenabzug","v":851},"(mm)"]
[]
[null,null,"For information: clearance with open doors"]
[]
[null,null,"LWt","Clearance with open doors",{"$f":"((E2_W1-E2_WFA_final-E2_WF1-E2_WSZ_final-2*E2_Glasstärke-E2_Glasscheibenabstand)^2+(E2_W2-E2_WFA_final-E2_WF2-E2_WSZ_final-2*E2_Glasstärke-E2_Glasscheibenabstand)^2)^0.5","v":{"v":532.4514062334703,"d":"532"}},"(mm)"]
[]
[]
[null,{"$f":"Haftungsausschluss","v":"Willach assumes no liability for damage of any kind that could arise as a result of using this profile and glass dimensions calculator. (11.05.2016 Rev. 3)"}]
[]
[null,{"$f":"corner_1_sash!B131","v":"Order list"}]
[]
[null,null,{"$f":"corner_1_sash!C133","v":"Profile sets"}]
[]
[null,null,"Description",null,"Article number",{"$nulls":3},"Quantity","Unit","Sales length","Cut length*"]
[null,null,"Profile set for side 1",null,{"$f":"IF(K147<1000,\"612 070.0\"&K147&\".111\",\"612 070.\"&K147&\".111\")","v":"612 070.0950.111"},{"$nulls":3},1,"piece",{"$f":"VLOOKUP(L147,$E$227:$I$230,2,TRUE)","v":{"v":950,"d":"950 mm"}},{"$f":"E2_LS1","v":{"v":851,"d":"851 mm"}}]
[null,null,"Profile set for side 2",null,{"$f":"IF(K148<1000,\"612 070.0\"&K148&\".111\",\"612 070.\"&K148&\".111\")","v":"612 070.0950.111"},{"$nulls":3},1,"piece",{"$f":"VLOOKUP(L148,$E$227:$I$230,2,TRUE)","v":{"v":950,"d":"950 mm"}},{"$f":"E2_LS2","v":{"v":851,"d":"851 mm"}}]
[]
[null,null,{"$f":"corner_1_sash!C140","v":"Accessory kits"}]
[]
[null,null,"Description",null,"Article number",{"$nulls":3},"Quantity","Unit"]
[null,null,"Accessory kit door sash 20 kg",null,"612 002.0000.000",{"$nulls":3},{"$f":"IF(AND(E2_Flügelgewicht_1<=20,E2_Flügelgewicht_2<=20),2,IF(OR(E2_Flügelgewicht_1<=20,E2_Flügelgewicht_2<=20),1,0))","v":2},"piece"]
[null,null,"Accessory kit door sash 40 kg",null,"612 004.0000.000",{"$nulls":3},{"$f":"IF(AND(E2_Flügelgewicht_1>20,E2_Flügelgewicht_2>20),2,IF(OR(E2_Flügelgewicht_1>20,E2_Flügelgewicht_2>20),1,0))","v":0},"piece"]
[null,null,"Accessory kit installation",null,"612 010.0000.000",{"$nulls":3},1,"piece"]
[null,null,"Accessory kit corner bracket",null,"612 020.0000.000",{"$nulls":3},1,"piece"]
[]
[null,null,{"$f":"corner_1_sash!C148","v":"Sealing strips (optional, please see above to select or deselect)"}]
[]
[null,null,"Description",null,"Article number",{"$nulls":3},"Quantity","Unit","Sales length","Cut length*"]
[null,null,"Magnetic seals 90°",null,{"$f":"\"612 420.\"&K161&\".305\"","v":"612 420.2000.305"},{"$nulls":3},{"$f":"IF(E2_Wahl_Dichtl_schließseitig=\"Yes\",1,0)","v":1},"pair",{"$f":"VLOOKUP(L161,$E$232:$I$233,2,TRUE)","v":{"v":2000,"d":"2,000 mm"}},{"$f":"E2_HS","v":{"v":1970,"d":"1,970 mm"}}]
[null,null,"Vertical sealing strips between fixed and sliding sash",null,{"$f":"\"612 440.\"&K162&\".305\"","v":"612 440.2000.305"},{"$nulls":3},{"$f":"IF(E2_Wahl_Dichtl_F_u_S=\"Yes\",2,0)","v":0},"pair",{"$f":"VLOOKUP(L162,$E$232:$I$233,2,TRUE)","v":{"v":2000,"d":"2,000 mm"}},{"$f":"E125-24","v":{"v":1934,"d":"1,934 mm"}}]
[]
[null,null,{"$f":"corner_1_sash!C154","v":"Threshold profile (optional, please see above to select or deselect)"}]
[]
[null,null,"Description",null,"Article number",{"$nulls":3},"Quantity","Unit","Sales length","Cut length*"]
[null,null,"Threshold profile, bevelled on one side, gloss-polished aluminium",null,"612 454.1000.111",{"$nulls":3},{"$f":"IF(E2_Wahl_Schwallschutz=\"Yes, made of gloss-polished aluminium\",1,0)","v":0},"pair",{"v":1000,"d":"1,000 mm"},{"$f":"E2_W1-E2_WF1-E2_WFA_final","v":{"v":476.5,"d":"477 mm"}},{"$f":"E2_W2-E2_WF2-E2_WFA_final","v":{"v":476.5,"d":"477 mm"}}]
[null,null,"Threshold profile, bevelled on one side, transparent plastic",null,"612 454.1000.305",{"$nulls":3},{"$f":"IF(E2_Wahl_Schwallschutz=\"Yes, made of transparent plastic\",1,0)","v":0},"pair",{"v":1000,"d":"1,000 mm"},{"$f":"E2_W1-E2_WF1-E2_WFA_final","v":{"v":476.5,"d":"477 mm"}},{"$f":"E2_W2-E2_WF2-E2_WFA_final","v":{"v":476.5,"d":"477 mm"}}]
[]
[null,null,{"$f":"corner_1_sash!C160","v":"Wall profile (optional, please see above to select or deselect)"}]
[]
[null,null,"Description",null,"Article number",{"$nulls":3},"Quantity","Unit","Sales length","Cut length*"]
[null,null,"Wall profile incl. plastic insert",null,{"$f":"\"612 520.\"&K173&\".111\"","v":"612 520.2000.111"},{"$nulls":3},{"$f":"IF(E2_Wahl_Wandanschluss=\"Profile\",2,0)","v":0},"piece",{"$f":"VLOOKUP(L173,$E$232:$I$233,2,TRUE)","v":{"v":2000,"d":"2,000 mm"}},{"$f":"E2_H-50","v":{"v":1950,"d":"1,950 mm"}}]
[]
[null,null,{"$f":"corner_1_sash!C165","v":"Floor profile (optional, please see above to select or deselect)"}]
[]
[null,null,"Description",null,"Article number",{"$nulls":3},"Quantity","Unit","Sales length"]
[null,null,"Floor profile length 1000 mm",null,{"$f":"\"612 530.\"&K178&\".111\"","v":"612 530.1000.111"},{"$nulls":3},{"$f":"IF(E2_Wahl_Bodenprofil=\"Yes\",L192,0)","v":0},{"$f":"corner_1_sash!J168","v":"piece"},{"v":1000,"d":"1,000 mm"}]
[null,null,"Floor profile length 1500 mm",null,{"$f":"\"612 530.\"&K179&\".111\"","v":"612 530.1500.111"},{"$nulls":3},{"$f":"IF(E2_Wahl_Bodenprofil=\"Yes\",M192,0)","v":0},{"$f":"corner_1_sash!J169","v":"piece"},{"v":1500,"d":"1,500 mm"}]
[]
[null,null,"Description",null,"Glass width of fixed sashes"]
[null,null,"Approximate required length of floor profile for fixed sash 1",null,{"$f":"E2_WF1","v":{"v":420.5,"d":"421 mm"}}]
[null,null,"Approximate required length of floor profile for fixed sash 2",null,{"$f":"E2_WF2","v":{"v":420.5,"d":"421 mm"}}]
[null,null,"Approximate required total length of floor profile",null,{"$f":"SUM(E182:H183)","v":{"v":841,"d":"841 mm"}}]
[]
[null,null,"Kaufvarianten"]
[]
[{"$nulls":11},"Im Minimum-Fall"]
[null,null,"Zusammenfassung",{"$nulls":5},"Preis Summe","Mögl.?","Minimum und möglich?","Anzahl 1000 mm","Anzahl 1500 mm"]
[null,null,{"$f":"C194","v":"Variante 1: Alle einzeln"},{"$nulls":5},{"$f":"IF(J190=\"Ja\",M197,\"n.a.\")","v":{"v":64.44,"d":"64"}},{"$f":"E205","v":"Ja"},{"$f":"IF(AND(I190=MIN($I$190:$I$191),J190=\"Ja\"),\"Ja\",\"Nein\")","v":"Nein"},{"$f":"IF(K190=\"Ja\",I195,0)","v":0},{"$f":"IF(K190=\"Ja\",I196,0)","v":0}]
[null,null,{"$f":"C207","v":"Variante 2: Alle zusammen"},{"$nulls":5},{"$f":"IF(J191=\"Ja\",M210,\"n.a.\")","v":{"v":32.22,"d":"32"}},{"$f":"E218","v":"Ja"},{"$f":"IF(AND(I191=MIN($I$190:$I$191),J191=\"Ja\"),\"Ja\",\"Nein\")","v":"Ja"},{"$f":"IF(K191=\"Ja\",I208,0)","v":1},{"$f":"IF(K191=\"Ja\",I209,0)","v":0}]
[{"$nulls":11},{"$f":"SUM(L190:L191)","v":1},{"$f":"SUM(M190:M191)","v":0}]
[]
[null,null,"Variante 1: Alle einzeln",null,"Artikelnummer",{"$nulls":3},"Anzahl","Einheit","Verkaufslänge","Brutto-VK-Preis","Summe Brutto-VK-Preis"]
[null,null,"Anzahl benötigter Bodenprofile in Länge 1000 mm",null,{"$f":"\"612 XXX.\"&K195&\".111\"","v":"612 XXX.1000.111"},{"$nulls":3},{"$f":"COUNTIF(H200:I$202,K195)","v":2},"Stück",{"v":1000,"d":"1,000 mm"},{"$f":"$F$238","v":{"v":32.22,"d":"32.22 €"}},{"$f":"I195*L195","v":{"v":64.44,"d":"64.44 €"}}]
[null,null,"Anzahl benötigter Bodenprofile in Länge 1500 mm",null,{"$f":"\"612 XXX.\"&K196&\".111\"","v":"612 XXX.1500.111"},{"$nulls":3},{"$f":"COUNTIF(H200:I202,K196)","v":0},"Stück",{"v":1500,"d":"1,500 mm"},{"$f":"$F$239","v":{"v":48.33,"d":"48.33 €"}},{"$f":"I196*L196","v":0}]
[{"$nulls":12},{"$f":"M195+M196","v":{"v":64.44,"d":"64.44 €"}}]
[]
[{"$nulls":4},"Länge ben.",{"$nulls":3},"Verkaufslänge"]
[null,null,{"$f":"C182","v":"Approximate required length of floor profile for fixed sash 1"},null,{"$f":"E182","v":{"v":420.5,"d":"421 mm"}},{"$nulls":3},{"$f":"IF(E200<=1500,VLOOKUP(E200,$E$235:$I$236,2,TRUE),\"nicht vorhanden\")","v":{"v":1000,"d":"1,000 mm"}}]
[null,null,{"$f":"C183","v":"Approximate required length of floor profile for fixed sash 2"},null,{"$f":"E183","v":{"v":420.5,"d":"421 mm"}},{"$nulls":3},{"$f":"IF(E201<=1500,VLOOKUP(E201,$E$235:$I$236,2,TRUE),\"nicht vorhanden\")","v":{"v":1000,"d":"1,000 mm"}}]
[]
[null,null,"Summe",null,{"$f":"SUM(E200:F202)","v":{"v":841,"d":"841 mm"}}]
[]
[null,null,"Ist die Variante eine mögliche Lösung?",null,{"$f":"IF(OR(I200=\"nicht vorhanden\",I201=\"nicht vorhanden\",I202=\"nicht vorhanden\"),\"Nein\",\"Ja\")","v":"Ja"}]
[]
[null,null,"Variante 2: Alle zusammen",null,"Artikelnummer",{"$nulls":3},"Anzahl","Einheit","Verkaufslänge","Brutto-VK-Preis","Summe Brutto-VK-Preis"]
[null,null,"Anzahl benötigter Bodenprofile in Länge 1000 mm",null,{"$f":"\"612 XXX.\"&K208&\".111\"","v":"612 XXX.1000.111"},{"$nulls":3},{"$f":"COUNTIF($H$213:$I$215,K208)","v":1},"Stück",{"v":1000,"d":"1,000 mm"},{"$f":"$F$238","v":{"v":32.22,"d":"32.22 €"}},{"$f":"I208*L208","v":{"v":32.22,"d":"32.22 €"}}]
[null,null,"Anzahl benötigter Bodenprofile in Länge 1500 mm",null,{"$f":"\"612 XXX.\"&K209&\".111\"","v":"612 XXX.1500.111"},{"$nulls":3},{"$f":"COUNTIF($H$213:$I$215,K209)","v":0},"Stück",{"v":1500,"d":"1,500 mm"},{"$f":"$F$239","v":{"v":48.33,"d":"48.33 €"}},{"$f":"I209*L209","v":0}]
[{"$nulls":12},{"$f":"M208+M209","v":{"v":32.22,"d":"32.22 €"}}]
[]
[{"$nulls":4},"Länge ben.",{"$nulls":3},"Verkaufslänge"]
[null,null,"Ungefähr benötigte Länge an Bodenprofil für alle zusammen",null,{"$f":"E184","v":{"v":841,"d":"841 mm"}},{"$nulls":3},{"$f":"IF(E213<=1500,VLOOKUP(E213,$E$235:$I$236,2,TRUE),\"nicht vorhanden\")","v":{"v":1000,"d":"1,000 mm"}}]
[]
[]
[null,null,"Summe",null,{"$f":"SUM(E213:F215)","v":{"v":841,"d":"841 mm"}}]
[]
[null,null,"Ist die Variante eine mögliche Lösung?",null,{"$f":"IF(OR(I213=\"nicht vorhanden\",I214=\"nicht vorhanden\",I215=\"nicht vorhanden\"),\"Nein\",\"Ja\")","v":"Ja"}]
[]
[null,null,{"$f":"corner_1_sash!C210","v":"Finger pull handle (optional, please see above to select or deselect)"}]
[]
[null,null,{"$f":"corner_1_sash!C212","v":"Description"},null,{"$f":"corner_1_sash!E212","v":"Article number"},{"$nulls":3},{"$f":"corner_1_sash!I212","v":"Quantity"},{"$f":"corner_1_sash!J212","v":"Unit"},{"$nulls":3},{"$f":"corner_1_sash!N212","v":"* With exactly vertical walls and horizontal floors."}]
[null,null,{"$f":"corner_1_sash!C213","v":"Round finger pull handle, diameter 39 mm (diameter of glass drill hole 10 mm), 1 pair for 1 sash (inside and outside), stainless steel"},null,"612 267.0000.020",{"$nulls":3},{"$f":"IF(E2_Wahl_Griff=\"Yes\",2,0)","v":2},{"$f":"corner_1_sash!J213","v":"pair"}]
[]
[]
[null,null,"Tabelle Profillängen"]
[{"$nulls":3},"Profil-Set",0,950,null,null,950]
[{"$nulls":4},950.01,1150,null,null,1150]
[{"$nulls":4},1150.01,1550,null,null,1550]
[{"$nulls":4},1550.01,2050,null,null,2050]
[]
[{"$nulls":3},"Wandprofil/Dichtleisten",0,2000,null,null,2000]
[{"$nulls":4},2000.01,2490,null,null,2490]
[]
[{"$nulls":3},"Bodenprofil",0,1000,null,null,1000,null,"mm"]
[{"$nulls":4},1000.01,1500,null,null,1500,null,"mm"]
[]
[{"$nulls":3},"Brutto-VK-Bodenprofil",1000,32.22]
[{"$nulls":4},1500,48.33]
[]
[null,{"$f":"Haftungsausschluss","v":"Willach assumes no liability for damage of any kind that could arise as a result of using this profile and glass dimensions calculator. (11.05.2016 Rev. 3)"}]

{"sheet":"corner_2_sashes_on_one_side","index":3,"n_rows":319,"n_cols":17,"rows_kept":319,"merged":[[0,1,0,14],[3,1,3,17],[4,1,48,17],[50,1,50,5],[50,7,50,17],[51,8,86,11],[51,12,51,17],[52,12,52,17],[53,12,53,17],[54,12,54,17],[55,12,55,17],[56,12,56,17],[57,12,57,17],[58,12,58,17],[59,12,59,17],[60,12,60,17],[61,12,61,17],[62,12,62,17],[63,12,63,17],[64,12,64,17],[65,12,86,17],[66,2,67,3],[66,4,67,4],[69,2,70,3],[69,4,70,4],[72,2,73,3],[72,4,73,4],[75,2,76,3],[78,3,78,4],[81,2,82,3],[81,4,82,4],[84,2,85,3],[84,4,85,4],[88,1,88,16],[90,1,90,17],[92,2,92,5],[92,7,92,16],[94,7,94,10],[96,7,96,10],[98,7,98,10],[100,7,100,10],[102,7,102,10],[104,7,104,10],[106,7,106,10],[108,7,108,10],[110,7,110,10],[118,2,119,16],[122,1,122,5],[122,7,122,17],[124,8,124,16],[126,9,126,10],[128,9,128,10],[130,2,131,4],[130,8,130,16],[132,9,132,10],[133,2,133,4],[134,9,134,10],[138,8,139,8],[138,9,139,10],[138,11,139,11],[138,12,139,12],[138,13,139,13],[138,16,139,16],[139,2,140,4],[141,8,142,8],[141,9,142,10],[141,11,142,11],[141,12,142,12],[141,13,142,13],[141,16,142,16],[142,2,142,4],[146,9,146,10],[147,9,147,10],[148,2,148,4],[148,8,149,16],[151,8,153,16],[154,2,154,4],[160,2,160,4],[164,2,164,4],[168,2,168,4],[173,1,173,16],[175,1,175,17],[177,2,177,3],[179,2,179,3],[179,4,179,7],[179,11,179,12],[179,14,179,16],[180,2,180,3],[180,4,180,7],[180,11,180,12],[181,2,181,3],[181,4,181,7],[181,11,181,12],[182,4,182,7],[182,11,183,12],[183,2,183,3],[185,2,185,3],[185,4,185,7],[185,11,185,12],[185,14,185,16],[186,2,186,3],[186,4,186,7],[187,2,187,3],[187,4,187,7],[188,2,188,3],[188,4,188,7],[189,2,189,3],[189,4,189,7],[191,2,191,12],[193,2,193,3],[193,4,193,7],[193,11,193,12],[193,14,193,16],[194,2,194,3],[194,4,194,7],[194,11,194,12],[194,13,195,13],[195,2,195,3],[195,4,195,7],[195,11,195,12],[197,2,197,12],[199,2,199,3],[199,4,199,7],[199,11,199,12],[199,14,199,16],[200,2,200,3],[200,4,200,7],[200,11,200,12],[201,2,201,3],[201,4,201,7],[201,11,201,12],[203,2,203,12],[205,2,205,3],[205,4,205,7],[205,11,205,12],[205,14,205,16],[206,2,206,3],[206,4,206,7],[206,11,206,12],[208,2,208,12],[210,2,210,3],[210,4,210,7],[211,2,211,3],[211,4,211,7],[212,2,212,3],[212,4,212,7],[214,2,214,3],[214,4,214,7],[214,11,214,12],[215,2,215,3],[215,4,215,7],[215,11,215,12],[216,2,216,3],[216,4,216,7],[217,2,217,3],[217,4,217,7],[217,11,217,12],[218,2,218,3],[218,4,218,7],[220,2,220,3],[222,11,222,12],[223,2,223,3],[223,5,223,7],[224,2,224,3],[225,2,225,3],[226,2,226,3],[227,2,227,3],[228,2,228,3],[230,2,230,3],[231,2,231,3],[231,4,231,7],[232,2,232,3],[232,4,232,7],[233,2,233,3],[233,4,233,7],[236,4,236,5],[236,8,236,9],[237,2,237,3],[237,4,237,5],[237,8,237,9],[238,2,238,3],[238,4,238,5],[238,8,238,9],[239,2,239,3],[239,4,239,5],[239,8,239,9],[240,2,240,3],[240,4,240,5],[241,8,241,9],[242,2,242,3],[242,8,242,9],[243,2,243,3],[244,2,244,3],[244,4,244,7],[245,2,245,3],[245,4,245,7],[246,2,246,3],[246,4,246,7],[249,4,249,5],[249,8,249,9],[250,2,250,3],[250,4,250,5],[250,8,250,9],[251,2,252,3],[251,4,251,5],[251,8,251,9],[252,4,252,5],[252,8,252,9],[253,2,253,3],[253,4,253,5],[255,2,255,3],[257,2,257,3],[257,4,257,7],[258,2,258,3],[258,4,258,7],[259,2,259,3],[259,4,259,7],[262,4,262,5],[262,8,262,9],[263,2,263,3],[263,4,263,5],[263,8,263,9],[264,2,265,3],[264,4,264,5],[264,8,264,9],[265,4,265,5],[265,8,265,9],[266,2,266,3],[266,4,266,5],[268,2,268,3],[270,2,270,3],[270,4,270,7],[271,2,271,3],[271,4,271,7],[272,2,272,3],[272,4,272,7],[275,4,275,5],[275,8,275,9],[276,2,276,3],[276,4,276,5],[276,8,276,9],[277,2,278,3],[277,4,277,5],[277,8,277,9],[278,4,278,5],[278,8,278,9],[279,2,279,3],[279,4,279,5],[281,2,281,3],[283,2,283,3],[283,4,283,7],[284,2,284,3],[284,4,284,7],[285,2,285,3],[285,4,285,7],[288,4,288,5],[288,8,288,9],[289,2,289,3],[289,4,289,5],[289,8,289,9],[290,2,291,3],[290,4,290,5],[290,8,290,9],[291,4,291,5],[291,8,291,9],[292,2,292,3],[292,4,292,5],[294,2,294,3],[296,2,296,4],[298,2,298,3],[298,4,298,7],[298,13,299,16],[299,2,299,3],[299,4,299,7],[302,2,302,16],[318,1,318,16]]}
[null,"Aquant 40: corner shower with 2 sliding sashes on one side"]
[]
[]
[null,{"$f":"corner_1_sash!B4","v":"Drawings"}]
{"$rows_empty":46}
[null,{"$f":"corner_1_sash!B29","v":"User input"},{"$nulls":5},{"$f":"corner_1_sash!H29","v":"Legend & Formulas"}]
[{"$nulls":8},"Legend\nW1 = System width of side 1\nW1.1 = System width of side 1 section 1\nW1.2 = System width of side 1 section 2\nW2 = System width of side 2\nH = System height\nLS1 = Length of track profile/cover profile 1\nLS2 =  Length of track profile/cover profile 2\nLWt = Clearance with open doors\n\nWS1.1 = Glass width of sliding sash 1.1 with handle\nWS1.2 = Glass width of sliding sash 1.2 with handle\nWSZ = Additional width of sliding sash for handle\nHS1.1 = Glass height of sliding sash 1.1\nHS1.2 = Glass height of sliding sash 1.2\n\nWF1.1 = Glass width of fixed sash 1.1\nWF1.2 = Glass width of fixed sash 1.2\nWF2 = Glass width of fixed sash 2\nWFA = Allowance for fixed sash for wall attachment\nWFZ1.1 = Additional width of fixed sash 1.1\nWFZ1.2 = Additional width of fixed sash 1.2\nHF1.1 = Glass height of fixed sash 1.1\nHF1.2 = Glass height of fixed sash 1.2\nHF2 = Glass height of fixed sash 2\n\nUF = Overlap between sliding sash and fixed sash\n\nSMs = Size of gap on the closing side\nSMo1.1 = Size of gap on the opening side for sliding sash 1.1\nSMo1.2 = Size of gap on the opening side for sliding sash 1.2\n",{"$nulls":3},"Formulas"]
[null,null,"W1","System width of side 1 (max. 2,000 mm)",{"v":1800,"d":"1,800"},"(mm)",{"$nulls":6},"W1.2 = W1 - W1.1"]
[{"$nulls":12},"WS1.1 = (W1.1 - SMs - WFA - WFZ1.1 + UF + WSZ) / 2"]
[null,null,"W1.1","System width of side 1 section 1",900,"(mm)",{"$nulls":6},"WF1.1 = WS1.1 - WSZ + WFZ1.1"]
[{"$nulls":12},"WS1.2 = (W1.2 - SMs - WFZ1.2 + UF + WSZ) / 2"]
[null,null,"W1.2","System width of side 1 section 2",{"$f":"E3_W1-E3_W1.1","v":900},"(mm)",{"$nulls":6},"WF1.2 = WS1.2 - WSZ + WFZ1.2"]
[{"$nulls":12},"WF2 = W2 - WFA - 11"]
[null,null,"W2","System width of side 2 (max. 1,200 mm)",{"v":1200,"d":"1,200"},"(mm)",{"$nulls":6},{"$f":"\"HS1.1 = HS1.2 = H - \"&E3_HSA_System","v":"HS1.1 = HS1.2 = H - 30"}]
[{"$nulls":12},{"$f":"\"HF1.1 = HF1.2 = HF2 = H - \"&E3_HFA_System","v":"HF1.1 = HF1.2 = HF2 = H - 42"}]
[null,null,"H","System height (max. 2,500 mm)",{"v":2000,"d":"2,000"},"(mm)",{"$nulls":6},"SMo1.1 = WFZ1.1 + WFA"]
[{"$nulls":12},"SMo1.2 = WFZ1.2 - 8"]
[null,null,"WFZ1.1","Additional width of fixed sash 1.1",17,"(mm)",{"$nulls":6},{"$f":"\"LS1 = W1 - \"&E3_Eckenabzug","v":"LS1 = W1 - 49"}]
[{"$nulls":12},{"$f":"\"LS2 = W2 - \"&E3_Eckenabzug","v":"LS2 = W2 - 49"}]
[null,null,"WFZ1.2","Additional width of fixed sash 1.2",38,"(mm)",{"$nulls":6},"LWt = W1 - WFA - WFZ1.1 - WS1.1 - WS1.2 - WFZ1.2"]
[]
[null,null,"Do you wish to attach the fixed sash to the wall via a wall profile or directly via silicon?",null,"Silicon"]
[]
[]
[null,null,"Do you wish to use the Aquant floor profile?",null,"No"]
[]
[]
[null,null,"Do you wish to use vertical sealing strips between fixed and sliding sash?",null,"No"]
[]
[]
[null,null,"Do you wish to use an optional threshold profile in the door area (in addition to the obligatory drip rail)?"]
[]
[]
[{"$nulls":3},"No"]
[]
[]
[null,null,"Do you wish to use the Aquant magnetic seals 180°?",null,"Yes"]
[]
[]
[null,null,"Do you wish to use the Aquant finger pull handle?",null,"Yes"]
[]
[]
[]
[null,{"$f":"Haftungsausschluss","v":"Willach assumes no liability for damage of any kind that could arise as a result of using this profile and glass dimensions calculator. (11.05.2016 Rev. 3)"}]
[]
[null,{"$f":"corner_1_sash!B63","v":"System dimensions"}]
[]
[null,null,{"$f":"corner_1_sash!C65","v":"System dimensions specified/recommended by Willach"},{"$nulls":4},{"$f":"corner_1_sash!H65","v":"Deviations from system dimensions"}]
[]
[null,null,"HSA",{"$f":"corner_1_sash!D67","v":"Höhenabzugsmaß für Aufnahme Schiebeflügel"},30,"(mm)",null,{"$f":"corner_1_sash!H67","v":"Deviation from system dimension?"},{"$nulls":3},{"$f":"IF(OR(E3_HSA_Wunsch=\"\",E3_HSA_Wunsch=E3_HSA_System),\"Nein\",\"Ja\")","v":"Nein"},{"$f":"corner_1_sash!M67","v":"Desired value"},null,null,{"$f":"IF(OR(L95=\"Nein\",O95=\"\"),E95,O95)","v":30},"(mm)"]
[]
[null,null,"WSZ",{"$f":"corner_1_sash!D69","v":"Additional width of sliding sash for handle"},69,"(mm)",null,{"$f":"corner_1_sash!H69","v":"Deviation from system dimension?"},{"$nulls":3},{"$f":"IF(OR(E3_WSZ_Wunsch=\"\",E3_WSZ_Wunsch=E3_WSZ_System),\"Nein\",\"Ja\")","v":"Nein"},{"$f":"corner_1_sash!M69","v":"Desired value"},null,null,{"$f":"IF(OR(L97=\"Nein\",O97=\"\"),E97,O97)","v":69},"(mm)"]
[]
[null,null,"WFA",{"$f":"corner_1_sash!D71","v":"Allowance for fixed sash for wall attachment"},{"$f":"IF(E67=\"Profile\",14,3)","v":3},"(mm)",null,{"$f":"corner_1_sash!H71","v":"Deviation from system dimension?"},{"$nulls":3},{"$f":"IF(OR(E3_WFA_Wunsch=\"\",E3_WFA_Wunsch=E3_WFA_System),\"Nein\",\"Ja\")","v":"Nein"},{"$f":"corner_1_sash!M71","v":"Desired value"},null,null,{"$f":"IF(OR(L99=\"Nein\",O99=\"\"),E99,O99)","v":3},"(mm)"]
[]
[null,null,"HFA",{"$f":"corner_1_sash!D73","v":"Höhenabzugsmaß für Aufnahme Festflügel"},42,"(mm)",null,{"$f":"corner_1_sash!H73","v":"Deviation from system dimension?"},{"$nulls":3},{"$f":"IF(OR(E3_HFA_Wunsch=\"\",E3_HFA_Wunsch=E3_HFA_System),\"Nein\",\"Ja\")","v":"Nein"},{"$f":"corner_1_sash!M73","v":"Desired value"},null,null,{"$f":"IF(OR(L101=\"Nein\",O101=\"\"),E101,O101)","v":42},"(mm)"]
[]
[null,null,"UF",{"$f":"corner_1_sash!D75","v":"Overlap between sliding sash and fixed sash"},{"$f":"IF(E73=\"Yes\",5,35)","v":35},"(mm)",null,{"$f":"corner_1_sash!H75","v":"Deviation from system dimension?"},{"$nulls":3},{"$f":"IF(OR(E3_UF_Wunsch=\"\",E3_UF_Wunsch=E3_UF_System),\"Nein\",\"Ja\")","v":"Nein"},{"$f":"corner_1_sash!M75","v":"Desired value"},null,null,{"$f":"IF(OR(L103=\"Nein\",O103=\"\"),E103,O103)","v":35},"(mm)"]
[]
[null,null,"SMs",{"$f":"corner_1_sash!D77","v":"Size of gap on the closing side"},10,"(mm)",null,{"$f":"corner_1_sash!H77","v":"Deviation from system dimension?"},{"$nulls":3},{"$f":"IF(OR(E3_SMs_Wunsch=\"\",E3_SMs_Wunsch=E3_SMs_System),\"Nein\",\"Ja\")","v":"Nein"},{"$f":"corner_1_sash!M77","v":"Desired value"},null,null,{"$f":"IF(OR(L105=\"Nein\",O105=\"\"),E105,O105)","v":10},"(mm)"]
[]
[{"$nulls":3},{"$f":"corner_1_sash!D79&\" Schiebeflg 1.1\"","v":"Vorgabe Mindest-Spaltmaß öffnungsseitig Schiebeflg 1.1"},{"$f":"IF($E$67=\"Profile\",40,20)","v":20},"(mm)",null,{"$f":"corner_1_sash!H79","v":"Deviation from system dimension?"},{"$nulls":3},{"$f":"IF(OR(E3_SMo1_Wunsch=\"\",E3_SMo1_Wunsch=E3_SMo1_System),\"Nein\",\"Ja\")","v":"Nein"},{"$f":"corner_1_sash!M79","v":"Desired value"},null,null,{"$f":"IF(OR(L107=\"Nein\",O107=\"\"),E107,O107)","v":20},"(mm)"]
[]
[{"$nulls":3},{"$f":"corner_1_sash!D79&\" Schiebeflg 1.2\"","v":"Vorgabe Mindest-Spaltmaß öffnungsseitig Schiebeflg 1.2"},30,"(mm)",null,{"$f":"corner_1_sash!H79","v":"Deviation from system dimension?"},{"$nulls":3},{"$f":"IF(OR(E3_SMo2_Wunsch=\"\",E3_SMo2_Wunsch=E3_SMo2_System),\"Nein\",\"Ja\")","v":"Nein"},{"$f":"corner_1_sash!M79","v":"Desired value"},null,null,{"$f":"IF(OR(L109=\"Nein\",O109=\"\"),E109,O109)","v":30},"(mm)"]
[]
[{"$nulls":3},{"$f":"corner_1_sash!D81","v":"Weight of Aquant handle"},0.2,"(kg)",null,{"$f":"corner_1_sash!H81","v":"Deviation from system dimension?"},{"$nulls":3},{"$f":"IF(OR(E3_Gewicht_Griff_Wunsch=\"\",E3_Gewicht_Griff_Wunsch=E3_Gewicht_Griff),\"Nein\",\"Ja\")","v":"Nein"},{"$f":"'corner_2_sashes_corner entry'!M83","v":"Desired value"},null,null,{"$f":"IF(OR(L111=\"Nein\",O111=\"\"),E111,O111)","v":0.2},"(kg)"]
[]
[{"$nulls":3},"Glasstärke",8,"(mm)"]
[]
[{"$nulls":3},"Eckenabzug",49,"(mm)"]
[]
[{"$nulls":3},"Glasscheibenabstand",15,"(mm)"]
[]
[null,null,{"$f":"IF(OR(L95=\"Ja\",L99=\"Ja\",L101=\"Ja\",L103=\"Ja\",L105=\"Ja\",L107=\"Ja\",L97=\"Ja\",L109=\"Ja\",L111=\"Ja\"),\"Caution: you are deviating from the suggested system dimension, please check whether the system can be built with the value you have selected!\",\"\")","v":""}]
[]
[]
[]
[null,{"$f":"corner_1_sash!B93","v":"Automatic calculation of glass dimensions and profile lengths*"},{"$nulls":5},{"$f":"corner_1_sash!H93","v":"Automatic check of door sash width, sash weight, aspect ratio and gap dimension on the opening side"}]
[]
[null,null,"Glass dimensions of sliding sash 1.1",{"$nulls":5},{"$f":"corner_1_sash!I95","v":"Check of the door sash width"}]
[]
[null,null,"WS1.1","Glass width of sliding sash 1.1 with handle",{"$f":"(E3_W1.1-E3_SMs_final-E3_WFA_final-E3_WFZ1.1+E3_UF_final+E3_WSZ_final)/2","v":487},"(mm)",null,null,"WS1.1",{"$f":"D127","v":"Glass width of sliding sash 1.1 with handle"},null,{"$f":"E3_WS1.1","v":487},"≥",380,"(mm)",null,{"$f":"IF(L127>=N127,\"Yes\",\"No\")","v":"Yes"}]
[]
[null,null,"HS1.1","Glass height of sliding sash 1.1",{"$f":"E3_H-E3_HSA_final","v":{"v":1970,"d":"1,970"}},"(mm)",null,null,"WS1.2",{"$f":"D136","v":"Glass width of sliding sash 1.2 with handle"},null,{"$f":"E3_WS1.2","v":478},"≥",380,"(mm)",null,{"$f":"IF(L129>=N129,\"Yes\",\"No\")","v":"Yes"}]
[]
[null,null,"Please note that drill holes are required, please refer to the relevant drilling drawings!",{"$nulls":5},{"$f":"corner_1_sash!I99","v":"Check of the sash weight"}]
[]
[{"$nulls":9},"Weight of sliding sash 1.1",null,{"$f":"ROUND(E3_WS1.1/1000*E3_HS/1000*2.5*E3_Glasstärke+E3_Gewicht_Griff_final,0)","v":19},"≤",40,"(kg)",null,{"$f":"IF(L133<=N133,\"Yes\",\"No\")","v":"Yes"}]
[null,null,"Glass dimensions of sliding sash 1.2"]
[{"$nulls":9},"Weight of sliding sash 1.2",null,{"$f":"ROUND(E3_WS1.2/1000*E138/1000*2.5*E3_Glasstärke+E3_Gewicht_Griff_final,0)","v":19},"≤",40,"(kg)",null,{"$f":"IF(OR(L135<N135,L135=N135),\"Yes\",\"No\")","v":"Yes"}]
[null,null,"WS1.2","Glass width of sliding sash 1.2 with handle",{"$f":"(E3_W1.2-E3_SMs_final-E3_WFZ1.2+E3_UF_final+E3_WSZ_final)/2","v":478},"(mm)"]
[{"$nulls":8},{"$f":"corner_1_sash!I103","v":"Check of the aspect ratio"}]
[null,null,"HS1.2","Glass height of sliding sash 1.2",{"$f":"E3_H-E3_HSA_final","v":{"v":1970,"d":"1,970"}},"(mm)"]
[{"$nulls":9},"Height-to-width ratio of sliding sash 1.1",null,{"$f":"ROUND(E3_HS/E3_WS1.1,2)","v":4.05},"≤",5,null,null,{"$f":"IF(L139<=N139,\"Yes\",\"No\")","v":"Yes"}]
[null,null,"Please note that drill holes are required, please refer to the relevant drilling drawings!"]
[]
[{"$nulls":9},"Height-to-width ratio of sliding sash 1.2",null,{"$f":"ROUND(E138/E3_WS1.2,2)","v":4.12},"≤",5,null,null,{"$f":"IF(L142<=N142,\"Yes\",\"No\")","v":"Yes"}]
[null,null,"Glass dimensions of fixed sash 1.1"]
[]
[null,null,"WF1.1","Glass width of fixed sash 1.1",{"$f":"E3_WS1.1-E3_WSZ_final+E3_WFZ1.1","v":435},"(mm)",null,null,{"$f":"corner_1_sash!I108","v":"Check of the gap dimension on the opening side"}]
[]
[null,null,"HF1.2","Glass height of fixed sash 1.1",{"$f":"E3_H-E3_HFA_final","v":{"v":1958,"d":"1,958"}},"(mm)",null,null,"SMo1.1","Gap dimension on the opening side for sliding sash 1.1",null,{"$f":"E3_WFZ1.1+E3_WFA_final","v":20},"≥",{"$f":"E3_SMo1_System","v":20},"(mm)",null,{"$f":"IF(L147>=N147,\"Yes\",\"No\")","v":"Yes"}]
[{"$nulls":8},"SMo1.2","Gap dimension on the opening side for sliding sash 1.2",null,{"$f":"E3_WFZ1.2-E3_Glasstärke","v":30},"≥",{"$f":"E3_SMo2_System","v":30},"(mm)",null,{"$f":"IF(L148>=N148,\"Yes\",\"No\")","v":"Yes"}]
[null,null,"Glass dimensions of fixed sash 1.2",{"$nulls":5},{"$f":"IF(OR(Q147=\"No\",Q148=\"No\"),\"Note: if the gap on the opening side is too small , please increase WFZ1.1 or WFZ1.2.\",\"\")","v":""}]
[]
[null,null,"WF1.2","Glass width of fixed sash 1.2",{"$f":"E3_WS1.2+E3_WFZ1.2-E3_WSZ_final","v":447},"(mm)"]
[{"$nulls":8},{"$f":"IF(OR(Q127=\"No\",Q129=\"No\",Q133=\"No\",Q135=\"No\",Q139=\"No\",Q142=\"No\",Q147=\"No\",Q148=\"No\"),\"Caution: the technical restrictions have not been observed; please change your planning!\",\"\")","v":""}]
[null,null,"HF1.2","Glass height of fixed sash 1.2",{"$f":"E3_HF","v":{"v":1958,"d":"1,958"}},"(mm)"]
[]
[null,null,"Glass dimensions of fixed sash 2"]
[]
[null,null,"WF2","Glass width of fixed sash 2",{"$f":"E3_W2-E3_WFA_final-11","v":{"v":1186,"d":"1,186"}},"(mm)"]
[]
[null,null,"HF2","Glass height of fixed sash 2",{"$f":"E3_HF","v":{"v":1958,"d":"1,958"}},"(mm)"]
[]
[null,null,"Length of track profile/cover profile 1"]
[]
[null,null,"LS1","Length of track profile/cover profile 1",{"$f":"E3_W1-E3_Eckenabzug","v":{"v":1751,"d":"1,751"}},"(mm)"]
[]
[null,null,"Length of track profile/cover profile 2"]
[]
[null,null,"LS2","Length of track profile/cover profile 2",{"$f":"E3_W2-E3_Eckenabzug","v":{"v":1151,"d":"1,151"}},"(mm)"]
[]
[null,null,"For information: clearance with open doors"]
[]
[null,null,"LWt","Clearance with open doors",{"$f":"E3_W1-E3_WFA_final-E3_WFZ1.1-E3_WS1.1-E3_WS1.2-E3_WFZ1.2","v":777},"(mm)"]
[]
[]
[null,{"$f":"Haftungsausschluss","v":"Willach assumes no liability for damage of any kind that could arise as a result of using this profile and glass dimensions calculator. (11.05.2016 Rev. 3)"}]
[]
[null,{"$f":"corner_1_sash!B131","v":"Order list"}]
[]
[null,null,{"$f":"corner_1_sash!C133","v":"Profile sets"}]
[]
[null,null,{"$f":"corner_1_sash!C135","v":"Description"},null,{"$f":"corner_1_sash!E135","v":"Article number"},{"$nulls":3},{"$f":"corner_1_sash!I135","v":"Quantity"},{"$f":"corner_1_sash!J135","v":"Unit"},{"$f":"corner_1_sash!K135","v":"Sales length"},{"$f":"corner_1_sash!L135","v":"Cut length*"}]
[null,null,{"$f":"corner_1_sash!C136","v":"Profile set for side 1"},null,{"$f":"IF(K181<1000,\"612 070.0\"&K181&\".111\",\"612 070.\"&K181&\".111\")","v":"612 070.2050.111"},{"$nulls":3},1,{"$f":"corner_1_sash!J136","v":"piece"},{"$f":"VLOOKUP(L181,$E$304:$I$308,2,TRUE)","v":{"v":2050,"d":"2,050 mm"}},{"$f":"E3_LS1","v":{"v":1751,"d":"1,751 mm"}}]
[null,null,{"$f":"corner_1_sash!C137","v":"Profile set for side 2"},null,{"$f":"IF(K182<1000,\"612 070.0\"&K182&\".111\",\"612 070.\"&K182&\".111\")","v":"612 070.1550.111"},{"$nulls":3},1,{"$f":"corner_1_sash!J137","v":"piece"},{"$f":"VLOOKUP(L182,$E$304:$I$308,2,TRUE)","v":{"v":1550,"d":"1,550 mm"}},{"$f":"E3_LS2","v":{"v":1151,"d":"1,151 mm"}}]
[]
[null,null,{"$f":"corner_1_sash!C140","v":"Accessory kits"}]
[]
[null,null,{"$f":"corner_1_sash!C142","v":"Description"},null,{"$f":"corner_1_sash!E150","v":"Article number"},{"$nulls":3},{"$f":"corner_1_sash!I142","v":"Quantity"},{"$f":"corner_1_sash!J142","v":"Unit"}]
[null,null,{"$f":"corner_1_sash!C143","v":"Accessory kit door sash 20 kg"},null,"612 002.0000.000",{"$nulls":3},{"$f":"IF(AND(E3_Flügelgewicht_1<=20,E3_Flügelgewicht_2<=20),2,IF(OR(E3_Flügelgewicht_1<=20,E3_Flügelgewicht_2<=20),1,0))","v":2},{"$f":"corner_1_sash!J143","v":"piece"}]
[null,null,{"$f":"corner_1_sash!C144","v":"Accessory kit door sash 40 kg"},null,"612 004.0000.000",{"$nulls":3},{"$f":"IF(AND(E3_Flügelgewicht_1>20,E3_Flügelgewicht_2>20),2,IF(OR(E3_Flügelgewicht_1>20,E3_Flügelgewicht_2>20),1,0))","v":0},{"$f":"corner_1_sash!J144","v":"piece"}]
[null,null,{"$f":"corner_1_sash!C145","v":"Accessory kit installation"},null,"612 010.0000.000",{"$nulls":3},1,{"$f":"corner_1_sash!J145","v":"piece"}]
[null,null,{"$f":"corner_1_sash!C146","v":"Accessory kit corner bracket"},null,"612 020.0000.000",{"$nulls":3},1,{"$f":"corner_1_sash!J146","v":"piece"}]
[]
[null,null,{"$f":"corner_1_sash!C148","v":"Sealing strips (optional, please see above to select or deselect)"}]
[]
[null,null,{"$f":"corner_1_sash!C150","v":"Description"},null,{"$f":"corner_1_sash!E150","v":"Article number"},{"$nulls":3},{"$f":"corner_1_sash!I150","v":"Quantity"},{"$f":"corner_1_sash!J150","v":"Unit"},{"$f":"corner_1_sash!K150","v":"Sales length"},{"$f":"corner_1_sash!L150","v":"Cut length*"}]
[null,null,"Magnetic seals 180°",null,{"$f":"\"612 430.\"&K195&\".305\"","v":"612 430.2000.305"},{"$nulls":3},{"$f":"IF(E3_Wahl_Dichtl_schließseitig=\"Yes\",1,0)","v":1},{"$f":"'corner_2_sashes_corner entry'!J161","v":"pair"},{"$f":"VLOOKUP(L195,$E$310:$I$311,2,TRUE)","v":{"v":2000,"d":"2,000 mm"}},{"$f":"E3_HS","v":{"v":1970,"d":"1,970 mm"}}]
[null,null,{"$f":"corner_1_sash!C152","v":"Vertical sealing strips between fixed and sliding sash"},null,{"$f":"\"612 440.\"&K196&\".305\"","v":"612 440.2000.305"},{"$nulls":3},{"$f":"IF(E3_Wahl_Dichtl_F_u_S=\"Yes\",2,0)","v":0},{"$f":"corner_1_sash!J152","v":"pair"},{"$f":"VLOOKUP(L196,$E$310:$I$311,2,TRUE)","v":{"v":2000,"d":"2,000 mm"}},{"$f":"E3_HF-24","v":{"v":1934,"d":"1,934 mm"}}]
[]
[null,null,{"$f":"corner_1_sash!C154","v":"Threshold profile (optional, please see above to select or deselect)"}]
[]
[null,null,{"$f":"corner_1_sash!C156","v":"Description"},null,{"$f":"corner_1_sash!E156","v":"Article number"},{"$nulls":3},{"$f":"corner_1_sash!I156","v":"Quantity"},{"$f":"corner_1_sash!J156","v":"Unit"},{"$f":"corner_1_sash!K156","v":"Sales length"},{"$f":"corner_1_sash!L156","v":"Cut length*"}]
[null,null,"Threshold profile, cut straight, gloss-polished aluminium",null,"612 450.1000.111",{"$nulls":3},{"$f":"IF(E3_Wahl_Schwallschutz=\"Yes, made of gloss-polished aluminium\",IF(L201<=1000,1,2),0)","v":0},{"$f":"corner_1_sash!J157","v":"piece"},{"v":1000,"d":"1,000 mm"},{"$f":"E3_LWt+2*E3_WSZ_final","v":{"v":915,"d":"915 mm"}}]
[null,null,"Threshold profile, cut straight, transparent plastic",null,"612 450.1000.305",{"$nulls":3},{"$f":"IF(E3_Wahl_Schwallschutz=\"Yes, made of transparent plastic\",IF(L201<=1000,1,2),0)","v":0},{"$f":"corner_1_sash!J158","v":"piece"},{"v":1000,"d":"1,000 mm"},{"$f":"E3_LWt+2*E3_WSZ_final","v":{"v":915,"d":"915 mm"}}]
[]
[null,null,{"$f":"corner_1_sash!C160","v":"Wall profile (optional, please see above to select or deselect)"}]
[]
[null,null,{"$f":"corner_1_sash!C162","v":"Description"},null,{"$f":"corner_1_sash!E162","v":"Article number"},{"$nulls":3},{"$f":"corner_1_sash!I162","v":"Quantity"},{"$f":"corner_1_sash!J162","v":"Unit"},{"$f":"corner_1_sash!K162","v":"Sales length"},{"$f":"corner_1_sash!L162","v":"Cut length*"}]
[null,null,{"$f":"corner_1_sash!C163","v":"Wall profile incl. plastic insert"},null,{"$f":"\"612 520.\"&K207&\".111\"","v":"612 520.2000.111"},{"$nulls":3},{"$f":"IF(E3_Wahl_Wandanschluss=\"Profile\",2,0)","v":0},{"$f":"corner_1_sash!J163","v":"piece"},{"$f":"VLOOKUP(L207,$E$310:$I$311,2,TRUE)","v":{"v":2000,"d":"2,000 mm"}},{"$f":"E3_H-50","v":{"v":1950,"d":"1,950 mm"}}]
[]
[null,null,{"$f":"corner_1_sash!C165","v":"Floor profile (optional, please see above to select or deselect)"}]
[]
[null,null,{"$f":"corner_1_sash!C167","v":"Description"},null,{"$f":"corner_1_sash!E167","v":"Article number"},{"$nulls":3},{"$f":"corner_1_sash!I167","v":"Quantity"},{"$f":"corner_1_sash!J167","v":"Unit"},{"$f":"corner_1_sash!K167","v":"Sales length"}]
[null,null,{"$f":"corner_1_sash!C168","v":"Floor profile length 1000 mm"},null,{"$f":"\"612 530.\"&K212&\".111\"","v":"612 530.1000.111"},{"$nulls":3},{"$f":"IF(E3_Wahl_Bodenprofil=\"Yes\",VLOOKUP(\"Ja\",$K$225:$M$229,2,0),0)","v":0},{"$f":"corner_1_sash!J168","v":"piece"},{"v":1000,"d":"1,000 mm"}]
[null,null,{"$f":"corner_1_sash!C169","v":"Floor profile length 1500 mm"},null,{"$f":"\"612 530.\"&K213&\".111\"","v":"612 530.1500.111"},{"$nulls":3},{"$f":"IF(E3_Wahl_Bodenprofil=\"Yes\",VLOOKUP(\"Ja\",$K$225:$M$229,3,0),0)","v":0},{"$f":"corner_1_sash!J169","v":"piece"},{"v":1500,"d":"1,500 mm"}]
[]
[null,null,{"$f":"corner_1_sash!C171","v":"Description"},null,{"$f":"corner_1_sash!E171","v":"Glass width of fixed sashes"}]
[null,null,"Approximate required length of floor profile for fixed sash 1.1",null,{"$f":"E3_WF1.1","v":{"v":435,"d":"435 mm"}}]
[null,null,"Approximate required length of floor profile for fixed sash 1.2",null,{"$f":"E3_WF1.2","v":{"v":447,"d":"447 mm"}}]
[null,null,"Approximate required length of floor profile for fixed sash 2",null,{"$f":"E3_WF2","v":{"v":1186,"d":"1,186 mm"}}]
[null,null,"Approximate required total length of floor profile",null,{"$f":"SUM(E216:H218)","v":{"v":2068,"d":"2,068 mm"}}]
[]
[null,null,"Kaufvarianten"]
[]
[{"$nulls":11},"Im Minimum-Fall"]
[null,null,"Zusammenfassung",{"$nulls":5},"Preis Summe","Mögl.?","Minimum und möglich?","Anzahl 1000 mm","Anzahl 1500 mm"]
[null,null,{"$f":"C232","v":"Variante 1: Alle einzeln"},{"$nulls":5},{"$f":"IF(J225=\"Ja\",M235,\"n.a.\")","v":{"v":112.77,"d":"113"}},{"$f":"E243","v":"Ja"},{"$f":"IF(AND(I225=MIN($I$225:$I$229),J225=\"Ja\"),\"Ja\",\"Nein\")","v":"Nein"},{"$f":"IF(K225=\"Ja\",I233,0)","v":0},{"$f":"IF(K225=\"Ja\",I234,0)","v":0}]
[null,null,{"$f":"C245","v":"Variante 2: Festflügel 1.1 einzeln, Rest zusammen"},{"$nulls":5},{"$f":"IF(J226=\"Ja\",M248,\"n.a.\")","v":"n.a."},{"$f":"E256","v":"Nein"},{"$f":"IF(AND(I226=MIN($I$225:$I$229),J226=\"Ja\"),\"Ja\",\"Nein\")","v":"Nein"},{"$f":"IF(K226=\"Ja\",I246,0)","v":0},{"$f":"IF(K226=\"Ja\",I247,0)","v":0}]
[null,null,{"$f":"C258","v":"Variante 3: Festflügel 1.2 einzeln, Rest zusammen"},{"$nulls":5},{"$f":"IF(J227=\"Ja\",M261,\"n.a.\")","v":"n.a."},{"$f":"E269","v":"Nein"},{"$f":"IF(AND(I227=MIN($I$225:$I$229),J227=\"Ja\"),\"Ja\",\"Nein\")","v":"Nein"},{"$f":"IF(K227=\"Ja\",I259,0)","v":0},{"$f":"IF(K227=\"Ja\",I260,0)","v":0}]
[null,null,{"$f":"C271","v":"Variante 4: Festflügel 2 einzeln, Rest zusammen"},{"$nulls":5},{"$f":"IF(J228=\"Ja\",M274,\"n.a.\")","v":{"v":80.55,"d":"81"}},{"$f":"E282","v":"Ja"},{"$f":"IF(AND(I228=MIN($I$225:$I$229),J228=\"Ja\"),\"Ja\",\"Nein\")","v":"Ja"},{"$f":"IF(K228=\"Ja\",I272,0)","v":1},{"$f":"IF(K228=\"Ja\",I273,0)","v":1}]
[null,null,{"$f":"C284","v":"Variante 5: Alle zusammen"},{"$nulls":5},{"$f":"IF(J229=\"Ja\",M287,\"n.a.\")","v":"n.a."},{"$f":"E295","v":"Nein"},{"$f":"IF(AND(I229=MIN($I$225:$I$229),J229=\"Ja\"),\"Ja\",\"Nein\")","v":"Nein"},{"$f":"IF(K229=\"Ja\",I285,0)","v":0},{"$f":"IF(K229=\"Ja\",I286,0)","v":0}]
[]
[]
[null,null,"Variante 1: Alle einzeln",null,"Artikelnummer",{"$nulls":3},"Anzahl","Einheit","Verkaufslänge","Brutto-VK-Preis","Summe Brutto-VK-Preis"]
[null,null,"Anzahl benötigter Bodenprofile in Länge 1000 mm",null,{"$f":"\"612 XXX.\"&K233&\".111\"","v":"612 XXX.1000.111"},{"$nulls":3},{"$f":"COUNTIF($I$238:$J$240,K233)","v":2},"Stück",{"v":1000,"d":"1,000 mm"},{"$f":"$F$316","v":{"v":32.22,"d":"32.22 €"}},{"$f":"I233*L233","v":{"v":64.44,"d":"64.44 €"}}]
[null,null,"Anzahl benötigter Bodenprofile in Länge 1500 mm",null,{"$f":"\"612 XXX.\"&K234&\".111\"","v":"612 XXX.1500.111"},{"$nulls":3},{"$f":"COUNTIF($I$238:$J$240,K234)","v":1},"Stück",{"v":1500,"d":"1,500 mm"},{"$f":"$F$317","v":{"v":48.33,"d":"48.33 €"}},{"$f":"I234*L234","v":{"v":48.33,"d":"48.33 €"}}]
[{"$nulls":12},{"$f":"M233+M234","v":{"v":112.77,"d":"112.77 €"}}]
[]
[{"$nulls":4},"Länge ben.",{"$nulls":3},"Verkaufslänge"]
[null,null,"Bodenprofil bei Festflügel 1.1",null,{"$f":"E216","v":{"v":435,"d":"435 mm"}},{"$nulls":3},{"$f":"IF(E238<=1500,VLOOKUP(E238,$E$313:$I$314,2,TRUE),\"nicht vorhanden\")","v":{"v":1000,"d":"1,000 mm"}}]
[null,null,"Bodenprofil bei Festflügel 1.2",null,{"$f":"E217","v":{"v":447,"d":"447 mm"}},{"$nulls":3},{"$f":"IF(E239<=1500,VLOOKUP(E239,$E$313:$I$314,2,TRUE),\"nicht vorhanden\")","v":{"v":1000,"d":"1,000 mm"}}]
[null,null,"Bodenprofil bei Festflügel 2",null,{"$f":"E218","v":{"v":1186,"d":"1,186 mm"}},{"$nulls":3},{"$f":"IF(E240<=1500,VLOOKUP(E240,$E$313:$I$314,2,TRUE),\"nicht vorhanden\")","v":{"v":1500,"d":"1,500 mm"}}]
[null,null,"Summe",null,{"$f":"SUM(E238:F240)","v":{"v":2068,"d":"2,068 mm"}}]
[]
[null,null,"Ist die Variante eine mögliche Lösung?",null,{"$f":"IF(OR(I238=\"nicht vorhanden\",I239=\"nicht vorhanden\",I240=\"nicht vorhanden\"),\"Nein\",\"Ja\")","v":"Ja"}]
[]
[null,null,"Variante 2: Festflügel 1.1 einzeln, Rest zusammen",null,"Artikelnummer",{"$nulls":3},"Anzahl","Einheit","Verkaufslänge","Brutto-VK-Preis","Summe Brutto-VK-Preis"]
[null,null,"Anzahl benötigter Bodenprofile in Länge 1000 mm",null,{"$f":"\"612 XXX.\"&K246&\".111\"","v":"612 XXX.1000.111"},{"$nulls":3},{"$f":"COUNTIF(H251:I253,K246)","v":1},"Stück",{"v":1000,"d":"1,000 mm"},{"$f":"$F$316","v":{"v":32.22,"d":"32.22 €"}},{"$f":"I246*L246","v":{"v":32.22,"d":"32.22 €"}}]
[null,null,"Anzahl benötigter Bodenprofile in Länge 1500 mm",null,{"$f":"\"612 XXX.\"&K247&\".111\"","v":"612 XXX.1500.111"},{"$nulls":3},{"$f":"COUNTIF(H251:I253,K247)","v":0},"Stück",{"v":1500,"d":"1,500 mm"},{"$f":"$F$317","v":{"v":48.33,"d":"48.33 €"}},{"$f":"I247*L247","v":0}]
[{"$nulls":12},{"$f":"M246+M247","v":{"v":32.22,"d":"32.22 €"}}]
[]
[{"$nulls":4},"Länge ben.",{"$nulls":3},"Verkaufslänge"]
[null,null,"Ungefähr benötigte Länge an Bodenprofil bei Festflügel 1.1",null,{"$f":"E216","v":{"v":435,"d":"435 mm"}},{"$nulls":3},{"$f":"IF(E251<=1500,VLOOKUP(E251,$E$313:$I$314,2,TRUE),\"nicht vorhanden\")","v":{"v":1000,"d":"1,000 mm"}}]
[null,null,"Ungefähr in Summe benötigte Länge an Bodenprofil für Festflügel 1.2 und Festflügel 2 in Summe",null,{"$f":"E217+E218","v":{"v":1633,"d":"1,633 mm"}},{"$nulls":3},{"$f":"IF(E252<=1500,VLOOKUP(E252,$E$313:$I$314,2,TRUE),\"nicht vorhanden\")","v":"nicht vorhanden"}]
[]
[null,null,"Summe",null,{"$f":"SUM(E251:F253)","v":{"v":2068,"d":"2,068 mm"}}]
[]
[null,null,"Ist die Variante eine mögliche Lösung?",null,{"$f":"IF(OR(I251=\"nicht vorhanden\",I252=\"nicht vorhanden\",I253=\"nicht vorhanden\"),\"Nein\",\"Ja\")","v":"Nein"}]
[]
[null,null,"Variante 3: Festflügel 1.2 einzeln, Rest zusammen",null,"Artikelnummer",{"$nulls":3},"Anzahl","Einheit","Verkaufslänge","Brutto-VK-Preis","Summe Brutto-VK-Preis"]
[null,null,"Anzahl benötigter Bodenprofile in Länge 1000 mm",null,{"$f":"\"612 XXX.\"&K259&\".111\"","v":"612 XXX.1000.111"},{"$nulls":3},{"$f":"COUNTIF(H264:I266,K259)","v":1},"Stück",{"v":1000,"d":"1,000 mm"},{"$f":"$F$316","v":{"v":32.22,"d":"32.22 €"}},{"$f":"I259*L259","v":{"v":32.22,"d":"32.22 €"}}]
[null,null,"Anzahl benötigter Bodenprofile in Länge 1500 mm",null,{"$f":"\"612 XXX.\"&K260&\".111\"","v":"612 XXX.1500.111"},{"$nulls":3},{"$f":"COUNTIF(H264:I266,K260)","v":0},"Stück",{"v":1500,"d":"1,500 mm"},{"$f":"$F$317","v":{"v":48.33,"d":"48.33 €"}},{"$f":"I260*L260","v":0}]
[{"$nulls":12},{"$f":"M259+M260","v":{"v":32.22,"d":"32.22 €"}}]
[]
[{"$nulls":4},"Länge ben.",{"$nulls":3},"Verkaufslänge"]
[null,null,"Ungefähr benötigte Länge an Bodenprofil bei Festflügel 1.2",null,{"$f":"E217","v":{"v":447,"d":"447 mm"}},{"$nulls":3},{"$f":"IF(E264<=1500,VLOOKUP(E264,$E$313:$I$314,2,TRUE),\"nicht vorhanden\")","v":{"v":1000,"d":"1,000 mm"}}]
[null,null,"Ungefähr in Summe benötigte Länge an Bodenprofil für Festflügel 1.1 und Festflügel 2 in Summe",null,{"$f":"E216+E218","v":{"v":1621,"d":"1,621 mm"}},{"$nulls":3},{"$f":"IF(E265<=1500,VLOOKUP(E265,$E$313:$I$314,2,TRUE),\"nicht vorhanden\")","v":"nicht vorhanden"}]
[]
[null,null,"Summe",null,{"$f":"SUM(E264:F266)","v":{"v":2068,"d":"2,068 mm"}}]
[]
[null,null,"Ist die Variante eine mögliche Lösung?",null,{"$f":"IF(OR(I264=\"nicht vorhanden\",I265=\"nicht vorhanden\",I266=\"nicht vorhanden\"),\"Nein\",\"Ja\")","v":"Nein"}]
[]
[null,null,"Variante 4: Festflügel 2 einzeln, Rest zusammen",null,"Artikelnummer",{"$nulls":3},"Anzahl","Einheit","Verkaufslänge","Brutto-VK-Preis","Summe Brutto-VK-Preis"]
[null,null,"Anzahl benötigter Bodenprofile in Länge 1000 mm",null,{"$f":"\"612 XXX.\"&K272&\".111\"","v":"612 XXX.1000.111"},{"$nulls":3},{"$f":"COUNTIF(H277:I279,K272)","v":1},"Stück",{"v":1000,"d":"1,000 mm"},{"$f":"$F$316","v":{"v":32.22,"d":"32.22 €"}},{"$f":"I272*L272","v":{"v":32.22,"d":"32.22 €"}}]
[null,null,"Anzahl benötigter Bodenprofile in Länge 1500 mm",null,{"$f":"\"612 XXX.\"&K273&\".111\"","v":"612 XXX.1500.111"},{"$nulls":3},{"$f":"COUNTIF(H277:I279,K273)","v":1},"Stück",{"v":1500,"d":"1,500 mm"},{"$f":"$F$317","v":{"v":48.33,"d":"48.33 €"}},{"$f":"I273*L273","v":{"v":48.33,"d":"48.33 €"}}]
[{"$nulls":12},{"$f":"M272+M273","v":{"v":80.55,"d":"80.55 €"}}]
[]
[{"$nulls":4},"Länge ben.",{"$nulls":3},"Verkaufslänge"]
[null,null,"Ungefähr benötigte Länge an Bodenprofil bei Festflügel 2",null,{"$f":"E218","v":{"v":1186,"d":"1,186 mm"}},{"$nulls":3},{"$f":"IF(E277<=1500,VLOOKUP(E277,$E$313:$I$314,2,TRUE),\"nicht vorhanden\")","v":{"v":1500,"d":"1,500 mm"}}]
[null,null,"Ungefähr in Summe benötigte Länge an Bodenprofil für Festflügel 1.1 und Festflügel 1.2 in Summe",null,{"$f":"E216+E217","v":{"v":882,"d":"882 mm"}},{"$nulls":3},{"$f":"IF(E278<=1500,VLOOKUP(E278,$E$313:$I$314,2,TRUE),\"nicht vorhanden\")","v":{"v":1000,"d":"1,000 mm"}}]
[]
[null,null,"Summe",null,{"$f":"SUM(E277:F279)","v":{"v":2068,"d":"2,068 mm"}}]
[]
[null,null,"Ist die Variante eine mögliche Lösung?",null,{"$f":"IF(OR(I277=\"nicht vorhanden\",I278=\"nicht vorhanden\",I279=\"nicht vorhanden\"),\"Nein\",\"Ja\")","v":"Ja"}]
[]
[null,null,"Variante 5: Alle zusammen",null,"Artikelnummer",{"$nulls":3},"Anzahl","Einheit","Verkaufslänge","Brutto-VK-Preis","Summe Brutto-VK-Preis"]
[null,null,"Anzahl benötigter Bodenprofile in Länge 1000 mm",null,{"$f":"\"612 XXX.\"&K285&\".111\"","v":"612 XXX.1000.111"},{"$nulls":3},{"$f":"COUNTIF(H290:I292,K285)","v":0},"Stück",{"v":1000,"d":"1,000 mm"},{"$f":"$F$316","v":{"v":32.22,"d":"32.22 €"}},{"$f":"I285*L285","v":0}]
[null,null,"Anzahl benötigter Bodenprofile in Länge 1500 mm",null,{"$f":"\"612 XXX.\"&K286&\".111\"","v":"612 XXX.1500.111"},{"$nulls":3},{"$f":"COUNTIF(H290:I292,K286)","v":0},"Stück",{"v":1500,"d":"1,500 mm"},{"$f":"$F$317","v":{"v":48.33,"d":"48.33 €"}},{"$f":"I286*L286","v":0}]
[{"$nulls":12},{"$f":"M285+M286","v":0}]
[]
[{"$nulls":4},"Länge ben.",{"$nulls":3},"Verkaufslänge"]
[null,null,"Ungefähr benötigte Länge an Bodenprofil für alle zusammen",null,{"$f":"E219","v":{"v":2068,"d":"2,068 mm"}},{"$nulls":3},{"$f":"IF(E290<=1500,VLOOKUP(E290,$E$313:$I$314,2,TRUE),\"nicht vorhanden\")","v":"nicht vorhanden"}]
[]
[]
[null,null,"Summe",null,{"$f":"SUM(E290:F292)","v":{"v":2068,"d":"2,068 mm"}}]
[]
[null,null,"Ist die Variante eine mögliche Lösung?",null,{"$f":"IF(OR(I290=\"nicht vorhanden\",I291=\"nicht vorhanden\",I292=\"nicht vorhanden\"),\"Nein\",\"Ja\")","v":"Nein"}]
[]
[null,null,{"$f":"corner_1_sash!C210","v":"Finger pull handle (optional, please see above to select or deselect)"}]
[]
[null,null,{"$f":"corner_1_sash!C212","v":"Description"},null,{"$f":"corner_1_sash!E212","v":"Article number"},{"$nulls":3},{"$f":"corner_1_sash!I212","v":"Quantity"},{"$f":"corner_1_sash!J212","v":"Unit"},{"$nulls":3},{"$f":"corner_1_sash!N212","v":"* With exactly vertical walls and horizontal floors."}]
[null,null,{"$f":"corner_1_sash!C213","v":"Round finger pull handle, diameter 39 mm (diameter of glass drill hole 10 mm), 1 pair for 1 sash (inside and outside), stainless steel"},null,"612 267.0000.020",{"$nulls":3},{"$f":"IF(E3_Wahl_Griff=\"Yes\",2,0)","v":2},{"$f":"corner_1_sash!J213","v":"pair"}]
[]
[]
[null,null,"Tabelle Profillängen"]
[{"$nulls":3},"Laufschiene/Blende",0,950,null,null,950,null,"mm"]
[{"$nulls":4},950.01,1150,null,null,1150,null,"mm"]
[{"$nulls":4},1150.01,1550,null,null,1550,null,"mm"]
[{"$nulls":4},1550.01,2050,null,null,2050,null,"mm"]
[{"$nulls":4},2050.01,4880,null,null,4880,null,"mm"]
[]
[{"$nulls":3},"Wandprofil/Dichtleisten",0,2000,null,null,2000,null,"mm"]
[{"$nulls":4},2000.01,2490,null,null,2490,null,"mm"]
[]
[{"$nulls":3},"Bodenprofil",0,1000,null,null,1000,null,"mm"]
[{"$nulls":4},1000.01,1500,null,null,1500,null,"mm"]
[]
[{"$nulls":3},"Brutto-VK-Bodenprofil",1000,32.22]
[{"$nulls":4},1500,48.33]
[]
[null,{"$f":"Haftungsausschluss","v":"Willach assumes no liability for damage of any kind that could arise as a result of using this profile and glass dimensions calculator. (11.05.2016 Rev. 3)"}]

{"sheet":"recess_1_sash","index":4,"n_rows":172,"n_cols":17,"rows_kept":172,"merged":[[0,1,0,14],[3,1,3,17],[4,1,26,17],[28,1,28,5],[28,7,28,17],[29,8,56,11],[29,12,29,17],[30,12,30,17],[31,12,31,17],[32,12,32,17],[33,12,33,17],[34,12,34,17],[35,12,35,17],[36,2,37,3],[36,4,37,4],[36,12,36,17],[37,12,56,17],[39,2,40,3],[39,4,40,4],[42,2,43,3],[42,4,43,4],[45,2,46,3],[48,3,48,4],[51,2,52,3],[51,4,52,4],[54,2,55,3],[54,4,55,4],[58,1,58,16],[61,1,61,17],[63,2,63,5],[63,7,63,16],[65,7,65,10],[67,7,67,10],[69,7,69,10],[71,7,71,10],[73,7,73,10],[75,7,75,10],[77,7,77,10],[79,7,79,10],[83,2,84,16],[87,1,87,5],[87,7,87,17],[89,8,89,16],[91,9,91,10],[95,2,96,4],[95,9,95,10],[99,9,100,10],[99,11,100,11],[99,12,100,12],[99,13,100,13],[99,14,100,14],[99,16,100,16],[104,2,104,4],[104,9,104,10],[105,8,105,16],[107,8,109,16],[108,2,108,4],[113,1,113,16],[115,1,115,17],[117,2,117,12],[119,2,119,3],[119,4,119,7],[119,11,119,12],[119,14,119,16],[120,2,120,3],[120,4,120,7],[120,11,120,12],[121,4,121,7],[122,2,122,8],[124,2,124,3],[124,4,124,7],[124,11,124,12],[124,14,124,16],[125,2,125,3],[125,4,125,7],[126,2,126,3],[126,4,126,7],[127,2,127,3],[127,4,127,7],[129,2,129,12],[131,2,131,3],[131,4,131,7],[131,11,131,12],[131,14,131,16],[132,2,132,3],[132,4,132,7],[132,11,132,12],[133,2,133,3],[133,4,133,7],[133,11,133,12],[135,2,135,12],[137,2,137,3],[137,4,137,7],[137,11,137,12],[137,14,137,16],[138,2,138,3],[138,4,138,7],[138,11,138,12],[139,2,139,3],[139,4,139,7],[139,11,139,12],[141,2,141,12],[143,2,143,3],[143,4,143,7],[143,11,143,12],[144,2,144,3],[144,4,144,7],[144,11,144,12],[146,2,146,12],[148,2,148,3],[148,4,148,7],[149,2,149,3],[149,4,149,7],[150,2,150,3],[150,4,150,7],[151,13,153,16],[152,2,152,3],[152,4,152,7],[152,11,152,12],[153,2,153,3],[153,4,153,7],[153,11,153,12],[155,2,155,12],[155,13,158,16],[157,2,157,3],[157,4,157,7],[158,2,158,3],[158,4,158,7],[161,2,161,16],[171,1,171,16]]}
[null,"Aquant 40: recess shower with 1 sliding sash"]
[]
[]
[null,{"$f":"corner_1_sash!B4","v":"Drawings"}]
{"$rows_empty":24}
[null,{"$f":"corner_1_sash!B29","v":"User input"},{"$nulls":5},{"$f":"corner_1_sash!H29","v":"Legend & Formulas"}]
[{"$nulls":8},"Legend\nW1 = System width of side 1\nH = System height\nLS1 = Length of track profile/cover profile 1\nLWt = Clearance with open door\n\nWS1 = Glass width of sliding sash 1 with handle\nWSZ = Additional width of sliding sash for handle\nHS1 = Glass height of sliding sash 1\n\nWF1 = Glass width of fixed sash 1\nWFA = Allowance for fixed sash for wall attachment\nWFZ1 = Additional width of fixed sash 1\nHF1 = Glass height of fixed sash 1\n\nUF = Overlap between sliding sash and fixed sash\n\nSMs = Size of gap on the closing side\nSMo1 = Size of gap on the opening side for sliding sash 1",{"$nulls":3},{"$f":"corner_1_sash!M30","v":"Formulas"}]
[null,null,"W1","System width of side 1 (max. 1,700 mm)",{"v":1500,"d":"1,500"},"(mm)",{"$nulls":6},"WS1 = (W1 - WFA - WFZ1 + WSZ + UF - SMs) / 2"]
[{"$nulls":12},"WF1 = WS1 - WSZ + WFZ1"]
[null,null,"H","System height (max. 2,500 mm)",{"v":2000,"d":"2,000"},"(mm)",{"$nulls":6},{"$f":"\"HS = H - \"&N1_HSA_System","v":"HS = H - 30"}]
[{"$nulls":12},{"$f":"\"HF = H - \"&N1_HFA_System","v":"HF = H - 42"}]
[null,null,"WFZ1","Additional width of fixed sash 1",17,"(mm)",{"$nulls":6},"SMo1 = WFZ1 + WFA"]
[{"$nulls":12},"LS1 = W1"]
[null,null,"Do you wish to attach the fixed sash to the wall via a wall profile or directly via silicon?",null,"Silicon",{"$nulls":7},"LWt = W1 - WFA - WF1 - WSZ"]
[]
[]
[null,null,"Do you wish to use the Aquant floor profile?",null,"No"]
[]
[]
[null,null,"Do you wish to use vertical sealing strips between fixed and sliding sash?",null,"No"]
[]
[]
[null,null,"Do you wish to use an optional threshold profile in the door area (in addition to the obligatory drip rail)?"]
[]
[]
[{"$nulls":3},"No"]
[]
[]
[null,null,"Do you wish to use the Aquant bulb seal?",null,"Yes"]
[]
[]
[null,null,"Do you wish to use the Aquant finger pull handle?",null,"Yes"]
[]
[]
[]
[null,{"$f":"Haftungsausschluss","v":"Willach assumes no liability for damage of any kind that could arise as a result of using this profile and glass dimensions calculator. (11.05.2016 Rev. 3)"}]
[]
[]
[null,{"$f":"corner_1_sash!B63","v":"System dimensions"}]
[]
[null,null,{"$f":"corner_1_sash!C65","v":"System dimensions specified/recommended by Willach"},{"$nulls":4},{"$f":"corner_1_sash!H65","v":"Deviations from system dimensions"}]
[]
[null,null,"HSA",{"$f":"corner_1_sash!D67","v":"Höhenabzugsmaß für Aufnahme Schiebeflügel"},30,"(mm)",null,{"$f":"corner_1_sash!H67","v":"Deviation from system dimension?"},{"$nulls":3},{"$f":"IF(OR(N1_HSA_Wunsch=\"\",N1_HSA_Wunsch=N1_HSA_System),\"Nein\",\"Ja\")","v":"Nein"},{"$f":"corner_1_sash!M67","v":"Desired value"},null,null,{"$f":"IF(OR(L66=\"Nein\",O66=\"\"),E66,O66)","v":30},"(mm)"]
[]
[null,null,"WSZ",{"$f":"corner_1_sash!D69","v":"Additional width of sliding sash for handle"},69,"(mm)",null,{"$f":"corner_1_sash!H69","v":"Deviation from system dimension?"},{"$nulls":3},{"$f":"IF(OR(N1_WSZ_Wunsch=\"\",N1_WSZ_Wunsch=N1_WSZ_System),\"Nein\",\"Ja\")","v":"Nein"},{"$f":"corner_1_sash!M69","v":"Desired value"},null,null,{"$f":"IF(OR(L68=\"Nein\",O68=\"\"),E68,O68)","v":69},"(mm)"]
[]
[null,null,"WFA",{"$f":"corner_1_sash!D71","v":"Allowance for fixed sash for wall attachment"},{"$f":"IF(E37=\"Profil\",14,3)","v":3},"(mm)",null,{"$f":"corner_1_sash!H71","v":"Deviation from system dimension?"},{"$nulls":3},{"$f":"IF(OR(N1_WFA_Wunsch=\"\",N1_WFA_Wunsch=N1_WFA_System),\"Nein\",\"Ja\")","v":"Nein"},{"$f":"corner_1_sash!M71","v":"Desired value"},null,null,{"$f":"IF(OR(L70=\"Nein\",O70=\"\"),E70,O70)","v":3},"(mm)"]
[]
[null,null,"HFA",{"$f":"corner_1_sash!D73","v":"Höhenabzugsmaß für Aufnahme Festflügel"},42,"(mm)",null,{"$f":"corner_1_sash!H73","v":"Deviation from system dimension?"},{"$nulls":3},{"$f":"IF(OR(N1_HFA_Wunsch=\"\",N1_HFA_Wunsch=N1_HFA_System),\"Nein\",\"Ja\")","v":"Nein"},{"$f":"corner_1_sash!M73","v":"Desired value"},null,null,{"$f":"IF(OR(L72=\"Nein\",O72=\"\"),E72,O72)","v":42},"(mm)"]
[]
[null,null,"UF",{"$f":"corner_1_sash!D75","v":"Overlap between sliding sash and fixed sash"},{"$f":"IF(E43=\"Yes\",5,35)","v":35},"(mm)",null,{"$f":"corner_1_sash!H75","v":"Deviation from system dimension?"},{"$nulls":3},{"$f":"IF(OR(N1_UF_Wunsch=\"\",N1_UF_Wunsch=N1_UF_System),\"Nein\",\"Ja\")","v":"Nein"},{"$f":"corner_1_sash!M75","v":"Desired value"},null,null,{"$f":"IF(OR(L74=\"Nein\",O74=\"\"),E74,O74)","v":35},"(mm)"]
[]
[null,null,"SMs",{"$f":"corner_1_sash!D77","v":"Size of gap on the closing side"},14,"(mm)",null,{"$f":"corner_1_sash!H77","v":"Deviation from system dimension?"},{"$nulls":3},{"$f":"IF(OR(N1_SMs_Wunsch=\"\",N1_SMs_Wunsch=N1_SMs_System),\"Nein\",\"Ja\")","v":"Nein"},{"$f":"corner_1_sash!M77","v":"Desired value"},null,null,{"$f":"IF(OR(L76=\"Nein\",O76=\"\"),E76,O76)","v":14},"(mm)"]
[]
[null,null,"SMo",{"$f":"corner_1_sash!D79","v":"Vorgabe Mindest-Spaltmaß öffnungsseitig"},{"$f":"IF($E$37=\"Profile\",40,20)","v":20},"(mm)",null,{"$f":"corner_1_sash!H79","v":"Deviation from system dimension?"},{"$nulls":3},{"$f":"IF(OR(N1_SMo_Wunsch=\"\",N1_SMo_Wunsch=N1_SMo_System),\"Nein\",\"Ja\")","v":"Nein"},{"$f":"corner_1_sash!M79","v":"Desired value"},null,null,{"$f":"IF(OR(L78=\"Nein\",O78=\"\"),E78,O78)","v":20},"(mm)"]
[]
[{"$nulls":3},{"$f":"corner_1_sash!D81","v":"Weight of Aquant handle"},0.2,"(kg)",null,{"$f":"corner_1_sash!H81","v":"Deviation from system dimension?"},{"$nulls":3},{"$f":"IF(OR(N1_Gewicht_Griff_Wunsch=\"\",N1_Gewicht_Griff_Wunsch=N1_Gewicht_Griff_System),\"Nein\",\"Ja\")","v":"Nein"},{"$f":"corner_1_sash!M81","v":"Desired value"},null,null,{"$f":"IF(OR(L80=\"Nein\",O80=\"\"),E80,O80)","v":0.2},"(kg)"]
[]
[{"$nulls":3},"Glasstärke",8,"(mm)"]
[]
[null,null,{"$f":"IF(OR(L66=\"Ja\",L70=\"Ja\",L72=\"Ja\",L74=\"Ja\",L76=\"Ja\",L78=\"Ja\",L68=\"Ja\",L80=\"Ja\"),\"Caution: you are deviating from the suggested system dimension, please check whether the system can be built with the value you have selected!\",\"\")","v":""}]
[]
[]
[]
[null,{"$f":"corner_1_sash!B93","v":"Automatic calculation of glass dimensions and profile lengths*"},{"$nulls":5},{"$f":"corner_1_sash!H93","v":"Automatic check of door sash width, sash weight, aspect ratio and gap dimension on the opening side"}]
[]
[null,null,{"$f":"corner_1_sash!C95","v":"Glass dimensions of sliding sash 1"},{"$nulls":5},{"$f":"corner_1_sash!I95","v":"Check of the door sash width"}]
[]
[null,null,"WS1",{"$f":"corner_1_sash!D97","v":"Glass width of sliding sash 1 with handle"},{"$f":"(N1_W1-N1_WFA_final-N1_WFZ1+N1_WSZ_final+N1_UF_final-N1_SMs_final)/2","v":785},"(mm)",null,null,"WS1",{"$f":"D92","v":"Glass width of sliding sash 1 with handle"},null,{"$f":"N1_WS1","v":785},"≥",380,"(mm)",null,{"$f":"IF(L92>=N92,\"Yes\",\"No\")","v":"Yes"}]
[]
[null,null,"HS1",{"$f":"corner_1_sash!D99","v":"Glass height of sliding sash 1"},{"$f":"N1_H-N1_HSA_final","v":{"v":1970,"d":"1,970"}},"(mm)",null,null,{"$f":"corner_1_sash!I99","v":"Check of the sash weight"}]
[]
[null,null,"Please note that drill holes are required, please refer to the relevant drilling drawings!",{"$nulls":6},{"$f":"corner_1_sash!J101","v":"Weight of sliding sash 1"},null,{"$f":"ROUND(N1_WS1/1000*N1_HS/1000*2.5*N1_Glasstärke+N1_Gewicht_Griff_final,0)","v":31},"≤",40,"(kg)",null,{"$f":"IF(L96<=N96,\"Yes\",\"No\")","v":"Yes"}]
[]
[{"$nulls":8},{"$f":"corner_1_sash!I103","v":"Check of the aspect ratio"}]
[null,null,{"$f":"corner_1_sash!C104","v":"Glass dimensions of fixed sash 1"}]
[{"$nulls":9},{"$f":"corner_1_sash!J105","v":"Height-to-width ratio of sliding sash 1"},null,{"$f":"ROUND(N1_HS/N1_WS1,2)","v":2.51},"≤",5,null,null,{"$f":"IF(L100<=N100,\"Yes\",\"No\")","v":"Yes"}]
[null,null,"WF1",{"$f":"corner_1_sash!D106","v":"Glass width of fixed sash 1"},{"$f":"N1_WS1-N1_WSZ_final+N1_WFZ1","v":733},"(mm)"]
[]
[null,null,"HF1",{"$f":"corner_1_sash!D108","v":"Glass height of fixed sash 1"},{"$f":"N1_H-N1_HFA_final","v":{"v":1958,"d":"1,958"}},"(mm)",null,null,{"$f":"corner_1_sash!I108","v":"Check of the gap dimension on the opening side"}]
[]
[null,null,{"$f":"corner_1_sash!C116&\"**\"","v":"Length of track profile/cover profile 1**"},{"$nulls":5},{"$f":"C78&1","v":"SMo1"},{"$f":"corner_1_sash!J110","v":" Gap dimension on the opening side for sliding sash 1"},null,{"$f":"N1_WFZ1+N1_WFA_final","v":20},"≥",{"$f":"P78","v":20},"(mm)",null,{"$f":"IF(L105>=N105,\"Yes\",\"No\")","v":"Yes"}]
[{"$nulls":8},{"$f":"IF(Q105=\"No\",\"Note: if the gap on the opening side is too small , please increase WFZ1.\",\"\")","v":""}]
[null,null,"LS1",{"$f":"corner_1_sash!D118&\"**\"","v":"Length of track profile/cover profile 1**"},{"$f":"N1_W1","v":{"v":1500,"d":"1,500"}},"(mm)"]
[{"$nulls":8},{"$f":"IF(OR(Q92=\"No\",Q96=\"No\",Q100=\"No\",Q105=\"No\",),\"Caution: the technical restrictions have not been observed; please change your planning!\",\"\")","v":""}]
[null,null,{"$f":"corner_1_sash!C124","v":"For information: clearance with open door"}]
[]
[null,null,"LWt",{"$f":"corner_1_sash!D126","v":"Clearance with open door"},{"$f":"N1_W1-N1_WFA_System-N1_WF1-N1_WSZ_final","v":695},"(mm)"]
[]
[]
[null,{"$f":"Haftungsausschluss","v":"Willach assumes no liability for damage of any kind that could arise as a result of using this profile and glass dimensions calculator. (11.05.2016 Rev. 3)"}]
[]
[null,{"$f":"corner_1_sash!B131","v":"Order list"}]
[]
[null,null,{"$f":"corner_1_sash!C133","v":"Profile sets"}]
[]
[null,null,{"$f":"corner_1_sash!C135","v":"Description"},null,{"$f":"corner_1_sash!E135","v":"Article number"},{"$nulls":3},{"$f":"corner_1_sash!I135","v":"Quantity"},{"$f":"corner_1_sash!J135","v":"Unit"},{"$f":"corner_1_sash!K135","v":"Sales length"},{"$f":"corner_1_sash!L135&\"/**\"","v":"Cut length*/**"}]
[null,null,{"$f":"corner_1_sash!C136","v":"Profile set for side 1"},null,{"$f":"IF(K121<1000,\"612 070.0\"&K121&\".111\",\"612 070.\"&K121&\".111\")","v":"612 070.1550.111"},{"$nulls":3},1,{"$f":"corner_1_sash!J136","v":"piece"},{"$f":"VLOOKUP(L121,$E$163:$I$167,2,TRUE)","v":{"v":1550,"d":"1,550 mm"}},{"$f":"N1_LS1","v":{"v":1500,"d":"1,500 mm"}}]
[]
[null,null,{"$f":"corner_1_sash!C140","v":"Accessory kits"}]
[]
[null,null,{"$f":"corner_1_sash!C142","v":"Description"},null,{"$f":"corner_1_sash!E142","v":"Article number"},{"$nulls":3},{"$f":"corner_1_sash!I142","v":"Quantity"},{"$f":"corner_1_sash!J142","v":"Unit"}]
[null,null,{"$f":"corner_1_sash!C143","v":"Accessory kit door sash 20 kg"},null,"612 002.0000.000",{"$nulls":3},{"$f":"IF(N1_Flügelgewicht_1<=20,1,0)","v":0},{"$f":"corner_1_sash!J143","v":"piece"}]
[null,null,{"$f":"corner_1_sash!C144","v":"Accessory kit door sash 40 kg"},null,"612 004.0000.000",{"$nulls":3},{"$f":"IF(N1_Flügelgewicht_1>20,1,0)","v":1},{"$f":"corner_1_sash!J144","v":"piece"}]
[null,null,{"$f":"corner_1_sash!C145","v":"Accessory kit installation"},null,"612 010.0000.000",{"$nulls":3},1,{"$f":"corner_1_sash!J145","v":"piece"}]
[]
[null,null,{"$f":"corner_1_sash!C148","v":"Sealing strips (optional, please see above to select or deselect)"}]
[]
[null,null,{"$f":"corner_1_sash!C150","v":"Description"},null,{"$f":"corner_1_sash!E150","v":"Article number"},{"$nulls":3},{"$f":"corner_1_sash!I150","v":"Quantity"},{"$f":"corner_1_sash!J150","v":"Unit"},{"$f":"corner_1_sash!K150","v":"Sales length"},{"$f":"corner_1_sash!L150","v":"Cut length*"}]
[null,null,{"$f":"corner_1_sash!C151","v":"Bulb seal"},null,{"$f":"\"612 410.\"&K133&\".305\"","v":"612 410.2000.305"},{"$nulls":3},{"$f":"IF(N1_Wahl_Dichtl_schließseitig=\"Yes\",1,0)","v":1},{"$f":"corner_1_sash!J151","v":"piece"},{"$f":"VLOOKUP(L133,$E$169:$I$170,2,TRUE)","v":{"v":2000,"d":"2,000 mm"}},{"$f":"N1_H - 60","v":{"v":1940,"d":"1,940 mm"}}]
[null,null,{"$f":"corner_1_sash!C152","v":"Vertical sealing strips between fixed and sliding sash"},null,{"$f":"\"612 440.\"&K134&\".305\"","v":"612 440.2000.305"},{"$nulls":3},{"$f":"IF(N1_Wahl_Dichtl_F_u_S=\"Yes\",1,0)","v":0},{"$f":"corner_1_sash!J152","v":"pair"},{"$f":"VLOOKUP(L134,$E$169:$I$170,2,TRUE)","v":{"v":2000,"d":"2,000 mm"}},{"$f":"N1_HF-24","v":{"v":1934,"d":"1,934 mm"}}]
[]
[null,null,{"$f":"corner_1_sash!C154","v":"Threshold profile (optional, please see above to select or deselect)"}]
[]
[null,null,{"$f":"corner_1_sash!C156","v":"Description"},null,{"$f":"corner_1_sash!E156","v":"Article number"},{"$nulls":3},{"$f":"corner_1_sash!I156","v":"Quantity"},{"$f":"corner_1_sash!J156","v":"Unit"},{"$f":"corner_1_sash!K156","v":"Sales length"},{"$f":"corner_1_sash!L156","v":"Cut length*"}]
[null,null,{"$f":"corner_1_sash!C157","v":"Threshold profile, cut straight, gloss-polished aluminium"},null,"612 450.1000.111",{"$nulls":3},{"$f":"IF(N1_Wahl_Schwallschutz=\"Yes, made of gloss-polished aluminium\",1,0)","v":0},{"$f":"corner_1_sash!J157","v":"piece"},"1000 mm",{"$f":"N1_LWt+N1_WSZ_final","v":{"v":764,"d":"764 mm"}}]
[null,null,{"$f":"corner_1_sash!C158","v":"Threshold profile, cut straight, transparent plastic"},null,"612 450.1000.305",{"$nulls":3},{"$f":"IF(N1_Wahl_Schwallschutz=\"Yes, made of transparent plastic\",1,0)","v":0},{"$f":"corner_1_sash!J158","v":"piece"},"1000 mm",{"$f":"N1_LWt+N1_WSZ_final","v":{"v":764,"d":"764 mm"}}]
[]
[null,null,{"$f":"corner_1_sash!C160","v":"Wall profile (optional, please see above to select or deselect)"}]
[]
[null,null,{"$f":"corner_1_sash!C162","v":"Description"},null,{"$f":"corner_1_sash!E162","v":"Article number"},{"$nulls":3},{"$f":"corner_1_sash!I162","v":"Quantity"},{"$f":"corner_1_sash!J162","v":"Unit"},{"$f":"corner_1_sash!K162","v":"Sales length"},{"$f":"corner_1_sash!L162","v":"Cut length*"}]
[null,null,{"$f":"corner_1_sash!C163","v":"Wall profile incl. plastic insert"},null,{"$f":"\"612 520.\"&K145&\".111\"","v":"612 520.2000.111"},{"$nulls":3},{"$f":"IF(N1_Wahl_Wandanschluss=\"Profile\",1,0)","v":0},{"$f":"corner_1_sash!J163","v":"piece"},{"$f":"VLOOKUP(L145,$E$169:$I$170,2,TRUE)","v":{"v":2000,"d":"2,000 mm"}},{"$f":"N1_H-50","v":{"v":1950,"d":"1,950 mm"}}]
[]
[null,null,{"$f":"corner_1_sash!C165","v":"Floor profile (optional, please see above to select or deselect)"}]
[]
[null,null,{"$f":"corner_1_sash!C167","v":"Description"},null,{"$f":"corner_1_sash!E167","v":"Article number"},{"$nulls":3},{"$f":"corner_1_sash!I167","v":"Quantity"},{"$f":"corner_1_sash!J167","v":"Unit"},{"$f":"corner_1_sash!K167","v":"Sales length"}]
[null,null,{"$f":"corner_1_sash!C168","v":"Floor profile length 1000 mm"},null,{"$f":"\"612 530.\"&K150&\".111\"","v":"612 530.1000.111"},{"$nulls":3},{"$f":"IF(N1_Wahl_Bodenprofil=\"No\",0,IF(E154<=1000,1,0))","v":0},{"$f":"corner_1_sash!J168","v":"piece"},{"v":1000,"d":"1,000 mm"}]
[null,null,{"$f":"corner_1_sash!C169","v":"Floor profile length 1500 mm"},null,{"$f":"\"612 530.\"&K151&\".111\"","v":"612 530.1500.111"},{"$nulls":3},{"$f":"IF(N1_Wahl_Bodenprofil=\"No\",0,IF(E154>1000,1,0))","v":0},{"$f":"corner_1_sash!J169","v":"piece"},{"v":1500,"d":"1,500 mm"}]
[{"$nulls":13},{"$f":"corner_1_sash!N212","v":"* With exactly vertical walls and horizontal floors."}]
[null,null,{"$f":"corner_1_sash!C171","v":"Description"},null,{"$f":"corner_1_sash!E171","v":"Glass width of fixed sashes"}]
[null,null,{"$f":"corner_1_sash!C172","v":"Approximate required length of floor profile for fixed sash 1"},null,{"$f":"N1_WF1","v":{"v":733,"d":"733 mm"}}]
[]
[null,null,{"$f":"corner_1_sash!C210","v":"Finger pull handle (optional, please see above to select or deselect)"},{"$nulls":10},"** We recommend that you deduct an additional 2 mm so that the profile can be inserted between the walls."]
[]
[null,null,{"$f":"corner_1_sash!C212","v":"Description"},null,{"$f":"corner_1_sash!E212","v":"Article number"},{"$nulls":3},{"$f":"corner_1_sash!I212","v":"Quantity"},{"$f":"corner_1_sash!J212","v":"Unit"}]
[null,null,{"$f":"corner_1_sash!C213","v":"Round finger pull handle, diameter 39 mm (diameter of glass drill hole 10 mm), 1 pair for 1 sash (inside and outside), stainless steel"},null,"612 267.0000.020",{"$nulls":3},{"$f":"IF(N1_Wahl_Griff=\"Yes\",1,0)","v":1},{"$f":"corner_1_sash!J213","v":"pair"}]
[]
[]
[null,null,"Tabelle Profillängen"]
[{"$nulls":3},"Laufschiene/Blende",0,950,null,null,950,null,"mm"]
[{"$nulls":4},950.01,1150,null,null,1150,null,"mm"]
[{"$nulls":4},1150.01,1550,null,null,1550,null,"mm"]
[{"$nulls":4},1550.01,2050,null,null,2050,null,"mm"]
[{"$nulls":4},2050.01,4880,null,null,4880,null,"mm"]
[]
[{"$nulls":3},"Wandprofil/Dichtleisten",0,2000,null,null,2000,null,"mm"]
[{"$nulls":4},2000.01,2490,null,null,2490,null,"mm"]
[]
[null,{"$f":"Haftungsausschluss","v":"Willach assumes no liability for damage of any kind that could arise as a result of using this profile and glass dimensions calculator. (11.05.2016 Rev. 3)"}]

{"sheet":"recess_2_sashes","index":5,"n_rows":236,"n_cols":17,"rows_kept":236,"merged":[[0,1,0,14],[3,1,3,17],[4,1,26,17],[28,1,28,5],[28,7,28,17],[29,8,62,11],[29,12,29,17],[30,12,30,17],[31,12,31,17],[32,12,32,17],[33,12,33,17],[34,12,34,17],[35,12,35,17],[36,12,36,17],[37,12,37,17],[38,12,38,17],[39,12,39,17],[40,12,40,17],[41,12,62,17],[42,2,43,3],[42,4,43,4],[45,2,46,3],[45,4,46,4],[48,2,49,3],[48,4,49,4],[51,2,52,3],[54,3,54,4],[57,2,58,3],[57,4,58,4],[60,2,61,3],[60,4,61,4],[64,1,64,16],[67,1,67,17],[69,2,69,5],[69,7,69,16],[71,7,71,10],[73,7,73,10],[75,7,75,10],[77,7,77,10],[79,7,79,10],[81,7,81,10],[83,7,83,10],[85,7,85,10],[89,2,90,16],[93,1,93,5],[93,7,93,17],[95,8,95,16],[97,9,97,10],[99,9,99,10],[101,2,102,4],[103,9,103,10],[104,2,104,4],[105,9,105,10],[109,8,110,8],[109,9,110,10],[109,11,110,11],[109,12,110,12],[109,13,110,13],[109,14,110,14],[109,16,110,16],[110,2,111,4],[112,8,113,8],[112,9,113,10],[112,11,113,11],[112,12,113,12],[112,13,113,13],[112,14,113,14],[112,16,113,16],[113,2,113,4],[117,9,117,10],[118,9,118,10],[119,2,119,4],[119,8,120,16],[122,8,124,16],[125,2,125,4],[129,2,129,4],[134,1,134,16],[136,1,136,17],[138,2,138,3],[140,2,140,3],[140,4,140,7],[140,11,140,12],[140,14,140,16],[141,2,141,3],[141,4,141,7],[141,11,141,12],[142,4,142,7],[143,2,143,3],[145,2,145,3],[145,4,145,7],[145,11,145,12],[145,14,145,16],[146,2,146,3],[146,4,146,7],[147,2,147,3],[147,4,147,7],[148,2,148,3],[148,4,148,7],[150,2,150,12],[152,2,152,3],[152,4,152,7],[152,11,152,12],[152,14,152,16],[153,2,153,3],[153,4,153,7],[153,11,153,12],[154,2,154,3],[154,4,154,7],[154,11,154,12],[156,2,156,12],[158,2,158,3],[158,4,158,7],[158,11,158,12],[158,14,158,16],[159,2,159,3],[159,4,159,7],[159,11,159,12],[160,2,160,3],[160,4,160,7],[160,11,160,12],[162,2,162,12],[164,2,164,3],[164,4,164,7],[164,11,164,12],[164,14,164,16],[165,2,165,3],[165,4,165,7],[165,11,165,12],[167,2,167,12],[169,2,169,3],[169,4,169,7],[170,2,170,3],[170,4,170,7],[171,2,171,3],[171,4,171,7],[173,2,173,3],[173,4,173,7],[173,11,173,12],[174,2,174,3],[174,4,174,7],[174,11,174,12],[174,13,176,16],[175,2,175,3],[175,4,175,7],[176,2,176,3],[176,4,176,7],[178,2,178,3],[180,11,180,12],[181,2,181,3],[181,5,181,7],[182,2,182,3],[183,2,183,3],[185,2,185,3],[186,2,186,3],[186,4,186,7],[187,2,187,3],[187,4,187,7],[188,2,188,3],[188,4,188,7],[191,4,191,5],[191,8,191,9],[192,2,192,3],[192,4,192,5],[192,8,192,9],[193,2,193,3],[193,4,193,5],[193,8,193,9],[194,2,194,3],[194,4,194,5],[194,8,194,9],[195,2,195,3],[195,4,195,5],[196,8,196,9],[197,2,197,3],[197,8,197,9],[199,2,199,3],[199,4,199,7],[200,2,200,3],[200,4,200,7],[201,2,201,3],[201,4,201,7],[204,4,204,5],[204,8,204,9],[205,2,205,3],[205,4,205,5],[205,8,205,9],[206,2,207,3],[206,4,206,5],[206,8,206,9],[207,4,207,5],[207,8,207,9],[208,2,208,3],[208,4,208,5],[210,2,210,3],[212,2,212,4],[212,13,215,16],[214,2,214,3],[214,4,214,7],[215,2,215,3],[215,4,215,7],[218,2,218,16],[235,1,235,16]]}
[null,"Aquant 40: recess shower with 2 sliding sashes"]
[]
[]
[null,{"$f":"corner_1_sash!B4","v":"Drawings"}]
{"$rows_empty":24}
[null,{"$f":"corner_1_sash!B29","v":"User input"},{"$nulls":5},{"$f":"corner_1_sash!H29","v":"Legend & Formulas"}]
[{"$nulls":8},"Legend\nW1 = System width of side 1\nW1.1 = System width of side 1 section 1\nW1.2 = System width of side 1 section 2\nH = System height\nLS1 = Length of track profile/cover profile 1\nLWt = Clearance with open doors\n\nWS1.1 = Glass width of sliding sash 1.1 with handle\nWS1.2 = Glass width of sliding sash 1.2 with handle\nWSZ = Additional width of sliding sash for handle\nHS1.1 = Glass height of sliding sash 1.1\nHS1.2 = Glass height of sliding sash 1.2\n\nWF1.1 = Glass width of fixed sash 1.1\nWF1.2 = Glass width of fixed sash 1.2\nWFA = Allowance for fixed sash for wall attachment\nWFZ1.1 = Additional width of fixed sash 1.1\nWFZ1.2 = Additional width of fixed sash 1.2\nHF1.1 = Glass height of fixed sash 1.1\nHF1.2 = Glass height of fixed sash 1.2\n\nUF = Overlap between sliding sash and fixed sash\n\nSMs = Size of gap on the closing side\nSMo1.1 = Size of gap on the opening side for sliding sash 1.1\nSMo1.2 = Size of gap on the opening side for sliding sash 1.2\n",{"$nulls":3},{"$f":"corner_1_sash!M30","v":"Formulas"}]
[null,null,"W1","System width of side 1 (max. 2,000 mm)",{"v":2000,"d":"2,000"},"(mm)",{"$nulls":6},"W1.2 = W1 - W1.1"]
[{"$nulls":12},"WS1.1 = (W1.1 - WFA - WFZ1.1 + WSZ + UF - SMs) / 2"]
[null,null,"W1.1","System width of side 1 section 1",{"v":1000,"d":"1,000"},"(mm)",{"$nulls":6},"WF1.1 = WS1.1 - WSZ + WFZ1.1"]
[{"$nulls":12},"WS1.2 = (W1.2 - WFA - WFZ1.2 + WSZ + UF - SMs) / 2"]
[null,null,"W1.2","System width of side 1 section 2",{"$f":"N2_W1-N2_W1.1","v":{"v":1000,"d":"1,000"}},"(mm)",{"$nulls":6},"WF1.2 = WS1.2 - WSZ + WFZ1.2"]
[{"$nulls":12},{"$f":"\"HS1.1 = HS1.2 = H - \"&N2_HSA_System","v":"HS1.1 = HS1.2 = H - 30"}]
[null,null,"H","System height (max. 2,500 mm)",{"v":2000,"d":"2,000"},"(mm)",{"$nulls":6},{"$f":"\"HF1.1 = HF1.2 = H - \"&N2_HFA_System","v":"HF1.1 = HF1.2 = H - 42"}]
[{"$nulls":12},"SMo1.1 = WFZ1.1 + WFA"]
[null,null,"WFZ1.1","Additional width of fixed sash 1.1",17,"(mm)",{"$nulls":6},"SMo1.2 = WFZ1.2 + WFA"]
[{"$nulls":12},"LS = W1"]
[null,null,"WFZ1.2","Additional width of fixed sash 1.2",17,"(mm)",{"$nulls":6},"LWt = W1 - 2 WFA - WF1.1 - WF1.2 - 2 WSZ - 2 SMs"]
[]
[null,null,"Do you wish to attach the fixed sash to the wall via a wall profile or directly via silicon?",null,"Silicon"]
[]
[]
[null,null,"Do you wish to use the Aquant floor profile?",null,"No"]
[]
[]
[null,null,"Do you wish to use vertical sealing strips between fixed and sliding sash?",null,"No"]
[]
[]
[null,null,"Do you wish to use an optional threshold profile in the door area (in addition to the obligatory drip rail)?"]
[]
[]
[{"$nulls":3},"No"]
[]
[]
[null,null,"Do you wish to use the Aquant magnetic seals 180°?",null,"Yes"]
[]
[]
[null,null,"Do you wish to use the Aquant finger pull handle?",null,"Yes"]
[]
[]
[]
[null,{"$f":"Haftungsausschluss","v":"Willach assumes no liability for damage of any kind that could arise as a result of using this profile and glass dimensions calculator. (11.05.2016 Rev. 3)"}]
[]
[]
[null,{"$f":"corner_1_sash!B63","v":"System dimensions"}]
[]
[null,null,{"$f":"corner_1_sash!C65","v":"System dimensions specified/recommended by Willach"},{"$nulls":4},{"$f":"corner_1_sash!H65","v":"Deviations from system dimensions"}]
[]
[null,null,"HSA",{"$f":"corner_1_sash!D67","v":"Höhenabzugsmaß für Aufnahme Schiebeflügel"},30,"(mm)",null,"vom Systemmaß abweichen?",{"$nulls":3},{"$f":"IF(OR(N2_HSA_Wunsch=\"\",N2_HSA_Wunsch=N2_HSA_System),\"Nein\",\"Ja\")","v":"Nein"},"gewünschter Wert",null,null,{"$f":"IF(OR(L72=\"Nein\",O72=\"\"),E72,O72)","v":30},"(mm)"]
[]
[null,null,"WSZ",{"$f":"corner_1_sash!D69","v":"Additional width of sliding sash for handle"},69,"(mm)",null,{"$f":"corner_1_sash!$H$69","v":"Deviation from system dimension?"},{"$nulls":3},{"$f":"IF(OR(N2_WSZ_Wunsch=\"\",N2_WSZ_Wunsch=N2_WSZ_System),\"Nein\",\"Ja\")","v":"Nein"},{"$f":"corner_1_sash!$M$69","v":"Desired value"},null,null,{"$f":"IF(OR(L74=\"Nein\",O74=\"\"),E74,O74)","v":69},"(mm)"]
[]
[null,null,"WFA",{"$f":"corner_1_sash!D71","v":"Allowance for fixed sash for wall attachment"},{"$f":"IF(E43=\"Profile\",14,3)","v":3},"(mm)",null,{"$f":"corner_1_sash!$H$71","v":"Deviation from system dimension?"},{"$nulls":3},{"$f":"IF(OR(N2_WFA_Wunsch=\"\",N2_WFA_Wunsch=N2_WFA_System),\"Nein\",\"Ja\")","v":"Nein"},{"$f":"corner_1_sash!$M$71","v":"Desired value"},null,null,{"$f":"IF(OR(L76=\"Nein\",O76=\"\"),E76,O76)","v":3},"(mm)"]
[]
[null,null,"HFA",{"$f":"corner_1_sash!D73","v":"Höhenabzugsmaß für Aufnahme Festflügel"},42,"(mm)",null,"vom Systemmaß abweichen?",{"$nulls":3},{"$f":"IF(OR(N2_HFA_Wunsch=\"\",N2_HFA_Wunsch=N2_HFA_System),\"Nein\",\"Ja\")","v":"Nein"},"gewünschter Wert",null,null,{"$f":"IF(OR(L78=\"Nein\",O78=\"\"),E78,O78)","v":42},"(mm)"]
[]
[null,null,"UF",{"$f":"corner_1_sash!D75","v":"Overlap between sliding sash and fixed sash"},{"$f":"IF(E49=\"Yes\",5,35)","v":35},"(mm)",null,{"$f":"corner_1_sash!$H$75","v":"Deviation from system dimension?"},{"$nulls":3},{"$f":"IF(OR(N2_UF_Wunsch=\"\",N2_UF_Wunsch=N2_UF_System),\"Nein\",\"Ja\")","v":"Nein"},{"$f":"corner_1_sash!$M$75","v":"Desired value"},null,null,{"$f":"IF(OR(L80=\"Nein\",O80=\"\"),E80,O80)","v":35},"(mm)"]
[]
[null,null,"SMs",{"$f":"corner_1_sash!D77","v":"Size of gap on the closing side"},10,"(mm)",null,{"$f":"corner_1_sash!$H$77","v":"Deviation from system dimension?"},{"$nulls":3},{"$f":"IF(OR(N2_SMs_Wunsch=\"\",N2_SMs_Wunsch=N2_SMs_System),\"Nein\",\"Ja\")","v":"Nein"},{"$f":"corner_1_sash!$M$77","v":"Desired value"},null,null,{"$f":"IF(OR(L82=\"Nein\",O82=\"\"),E82,O82)","v":10},"(mm)"]
[]
[null,null,"SMo",{"$f":"corner_1_sash!D79","v":"Vorgabe Mindest-Spaltmaß öffnungsseitig"},{"$f":"IF($E$43=\"Profile\",40,20)","v":20},"(mm)",null,"vom Systemmaß abweichen?",{"$nulls":3},{"$f":"IF(OR(N2_SMo_Wunsch=\"\",N2_SMo_Wunsch=N2_SMo_System),\"Nein\",\"Ja\")","v":"Nein"},"gewünschter Wert",null,null,{"$f":"IF(OR(L84=\"Nein\",O84=\"\"),E84,O84)","v":20},"(mm)"]
[]
[{"$nulls":3},{"$f":"corner_1_sash!D81","v":"Weight of Aquant handle"},0.2,"(kg)",null,{"$f":"corner_1_sash!$H$81","v":"Deviation from system dimension?"},{"$nulls":3},{"$f":"IF(OR(N2_Griff_Wunsch=\"\",N2_Griff_Wunsch=N2_Griff_System),\"Nein\",\"Ja\")","v":"Nein"},{"$f":"corner_1_sash!$M$81","v":"Desired value"},null,null,{"$f":"IF(OR(L86=\"Nein\",O86=\"\"),E86,O86)","v":0.2},"(kg)"]
[]
[{"$nulls":3},"Glasstärke",8,"(mm)"]
[]
[null,null,{"$f":"IF(OR(L72=\"Ja\",L76=\"Ja\",L78=\"Ja\",L80=\"Ja\",L82=\"Ja\",L84=\"Ja\",L74=\"Ja\",L86=\"Ja\"),\"Caution: you are deviating from the suggested system dimension, please check whether the system can be built with the value you have selected!\",\"\")","v":""}]
[]
[]
[]
[null,{"$f":"corner_1_sash!B93","v":"Automatic calculation of glass dimensions and profile lengths*"},{"$nulls":5},{"$f":"corner_1_sash!H93","v":"Automatic check of door sash width, sash weight, aspect ratio and gap dimension on the opening side"}]
[]
[null,null,{"$f":"corner_2_sashes_on_one_side!C125","v":"Glass dimensions of sliding sash 1.1"},{"$nulls":5},{"$f":"corner_1_sash!I95","v":"Check of the door sash width"}]
[]
[null,null,"WS1.1",{"$f":"corner_2_sashes_on_one_side!D127","v":"Glass width of sliding sash 1.1 with handle"},{"$f":"(N2_W1.1-N2_WFA_final-N2_WFZ1.1+N2_WSZ_final+N2_UF_final-N2_SMs_final)/2","v":537},"(mm)",null,null,"WS1.1",{"$f":"corner_2_sashes_on_one_side!J127","v":"Glass width of sliding sash 1.1 with handle"},null,{"$f":"N2_WS1","v":537},"≥",380,"(mm)",null,{"$f":"IF(L98>=N98,\"Yes\",\"No\")","v":"Yes"}]
[]
[null,null,"HS1.1",{"$f":"corner_2_sashes_on_one_side!D129","v":"Glass height of sliding sash 1.1"},{"$f":"N2_H-N2_HSA_final","v":{"v":1970,"d":"1,970"}},"(mm)",null,null,"WS1.2",{"$f":"corner_2_sashes_on_one_side!J129","v":"Glass width of sliding sash 1.2 with handle"},null,{"$f":"N2_WS2","v":537},"≥",380,"(mm)",null,{"$f":"IF(L100>=N100,\"Yes\",\"No\")","v":"Yes"}]
[]
[null,null,"Please note that drill holes are required, please refer to the relevant drilling drawings!",{"$nulls":5},{"$f":"corner_1_sash!I99","v":"Check of the sash weight"}]
[]
[{"$nulls":9},{"$f":"corner_2_sashes_on_one_side!J133","v":"Weight of sliding sash 1.1"},null,{"$f":"ROUND(N2_WS1/1000*N2_HS/1000*N2_Glasstärke*2.5+N2_Griff_final,0)","v":21},"≤",40,"(kg)",null,{"$f":"IF(L104<=N104,\"Yes\",\"No\")","v":"Yes"}]
[null,null,{"$f":"corner_2_sashes_on_one_side!C134","v":"Glass dimensions of sliding sash 1.2"}]
[{"$nulls":9},{"$f":"corner_2_sashes_on_one_side!J135","v":"Weight of sliding sash 1.2"},null,{"$f":"ROUND(N2_WS2/1000*E109/1000*2.5*N2_Glasstärke+N2_Griff_final,0)","v":21},"≤",40,"(kg)",null,{"$f":"IF(OR(L106<N106,L106=N106),\"Yes\",\"No\")","v":"Yes"}]
[null,null,"WS1.2",{"$f":"corner_2_sashes_on_one_side!D136","v":"Glass width of sliding sash 1.2 with handle"},{"$f":"(N2_W1.2-N2_WFA_final-N2_WFZ1.2+N2_WSZ_final+N2_UF_final-N2_SMs_final)/2","v":537},"(mm)"]
[{"$nulls":8},{"$f":"corner_1_sash!I103","v":"Check of the aspect ratio"}]
[null,null,"HS1.2",{"$f":"corner_2_sashes_on_one_side!D138","v":"Glass height of sliding sash 1.2"},{"$f":"N2_H-N2_HSA_final","v":{"v":1970,"d":"1,970"}},"(mm)"]
[{"$nulls":9},{"$f":"corner_2_sashes_on_one_side!J139","v":"Height-to-width ratio of sliding sash 1.1"},null,{"$f":"ROUND(N2_HS/N2_WS1,2)","v":3.67},"≤",5,null,null,{"$f":"IF(L110<=N110,\"Yes\",\"No\")","v":"Yes"}]
[null,null,"Please note that drill holes are required, please refer to the relevant drilling drawings!"]
[]
[{"$nulls":9},{"$f":"corner_2_sashes_on_one_side!J142","v":"Height-to-width ratio of sliding sash 1.2"},null,{"$f":"ROUND(E109/N2_WS2,2)","v":3.67},"≤",5,null,null,{"$f":"IF(L113<=N113,\"Yes\",\"No\")","v":"Yes"}]
[null,null,{"$f":"corner_2_sashes_on_one_side!C143","v":"Glass dimensions of fixed sash 1.1"}]
[]
[null,null,"WF1.1",{"$f":"corner_2_sashes_on_one_side!D145","v":"Glass width of fixed sash 1.1"},{"$f":"N2_WS1+N2_WFZ1.1-N2_WSZ_final","v":485},"(mm)",null,null,{"$f":"corner_1_sash!I108","v":"Check of the gap dimension on the opening side"}]
[]
[null,null,"HF1.1",{"$f":"corner_2_sashes_on_one_side!D147","v":"Glass height of fixed sash 1.1"},{"$f":"N2_H-N2_HFA_final","v":{"v":1958,"d":"1,958"}},"(mm)",null,null,{"$f":"C84&\"1.1\"","v":"SMo1.1"},{"$f":"corner_2_sashes_on_one_side!J147","v":"Gap dimension on the opening side for sliding sash 1.1"},null,{"$f":"N2_WFA_final+N2_WFZ1.1","v":20},"≥",{"$f":"P84","v":20},"(mm)",null,{"$f":"IF(L118>=N118,\"Yes\",\"No\")","v":"Yes"}]
[{"$nulls":8},{"$f":"C84&\"1.2\"","v":"SMo1.2"},{"$f":"corner_2_sashes_on_one_side!J148","v":"Gap dimension on the opening side for sliding sash 1.2"},null,{"$f":"N2_WFA_final+N2_WFZ1.2","v":20},"≥",{"$f":"N118","v":20},"(mm)",null,{"$f":"IF(L119>=N119,\"Yes\",\"No\")","v":"Yes"}]
[null,null,{"$f":"corner_2_sashes_on_one_side!C149","v":"Glass dimensions of fixed sash 1.2"},{"$nulls":5},{"$f":"IF(OR(Q118=\"No\",Q119=\"No\"),\"Note: if the gap on the opening side is too small , please increase WFZ1.1 or WFZ1.2.\",\"\")","v":""}]
[]
[null,null,"WF1.2",{"$f":"corner_2_sashes_on_one_side!D151","v":"Glass width of fixed sash 1.2"},{"$f":"N2_WS2+N2_WFZ1.2-N2_WSZ_final","v":485},"(mm)"]
[{"$nulls":8},{"$f":"IF(OR(Q98=\"No\",Q100=\"No\",Q104=\"No\",Q106=\"No\",Q110=\"No\",Q113=\"No\",Q118=\"No\",Q119=\"No\"),\"Caution: the technical restrictions have not been observed; please change your planning!\",\"\")","v":""}]
[null,null,"HF1.2",{"$f":"corner_2_sashes_on_one_side!D153","v":"Glass height of fixed sash 1.2"},{"$f":"N2_HF","v":{"v":1958,"d":"1,958"}},"(mm)"]
[]
[null,null,{"$f":"corner_1_sash!$C$116&\"**\"","v":"Length of track profile/cover profile 1**"}]
[]
[null,null,"LS1",{"$f":"corner_1_sash!$D$118&\"**\"","v":"Length of track profile/cover profile 1**"},{"$f":"N2_W1","v":{"v":2000,"d":"2,000"}},"(mm)"]
[]
[null,null,{"$f":"'corner_2_sashes_corner entry'!C135:E135","v":"For information: clearance with open doors"}]
[]
[null,null,"LWt",{"$f":"'corner_2_sashes_corner entry'!D137","v":"Clearance with open doors"},{"$f":"N2_W1-2*N2_WFA_final-2*N2_WSZ_final-N2_WF1.1-N2_WF1.2","v":886},"(mm)"]
[]
[]
[null,{"$f":"Haftungsausschluss","v":"Willach assumes no liability for damage of any kind that could arise as a result of using this profile and glass dimensions calculator. (11.05.2016 Rev. 3)"}]
[]
[null,{"$f":"corner_1_sash!$B$131","v":"Order list"}]
[]
[null,null,{"$f":"corner_1_sash!$C$133","v":"Profile sets"}]
[]
[null,null,{"$f":"corner_1_sash!$C$135","v":"Description"},null,{"$f":"corner_1_sash!$E$135","v":"Article number"},{"$nulls":3},{"$f":"corner_1_sash!$I$135","v":"Quantity"},{"$f":"corner_1_sash!$J$135","v":"Unit"},{"$f":"corner_1_sash!$K$135","v":"Sales length"},{"$f":"recess_1_sash!L120","v":"Cut length*/**"}]
[null,null,{"$f":"corner_1_sash!$C$136","v":"Profile set for side 1"},null,{"$f":"IF(K142<1000,\"612 070.0\"&K142&\".111\",\"612 070.\"&K142&\".111\")","v":"612 070.2050.111"},{"$nulls":3},1,{"$f":"corner_1_sash!$J$136","v":"piece"},{"$f":"VLOOKUP(L142,$E$220:$I$224,2,TRUE)","v":{"v":2050,"d":"2,050 mm"}},{"$f":"N2_LS","v":{"v":2000,"d":"2,000 mm"}}]
[]
[null,null,{"$f":"corner_1_sash!$C$140","v":"Accessory kits"}]
[]
[null,null,{"$f":"corner_1_sash!$C$142","v":"Description"},null,{"$f":"corner_1_sash!$E$142","v":"Article number"},{"$nulls":3},{"$f":"corner_1_sash!$I$142","v":"Quantity"},{"$f":"corner_1_sash!$J$142","v":"Unit"}]
[null,null,{"$f":"corner_1_sash!$C$143","v":"Accessory kit door sash 20 kg"},null,"612 002.0000.000",{"$nulls":3},{"$f":"IF(AND(N2_Flügelgewicht_1<=20,N2_Flügelgewicht_2<=20),2,IF(OR(N2_Flügelgewicht_1<=20,N2_Flügelgewicht_2<=20),1,0))","v":0},{"$f":"corner_1_sash!$J$143","v":"piece"}]
[null,null,{"$f":"corner_1_sash!$C$144","v":"Accessory kit door sash 40 kg"},null,"612 004.0000.000",{"$nulls":3},{"$f":"IF(AND(N2_Flügelgewicht_1>20,N2_Flügelgewicht_2>20),2,IF(OR(N2_Flügelgewicht_1>20,N2_Flügelgewicht_2>20),1,0))","v":2},{"$f":"corner_1_sash!$J$144","v":"piece"}]
[null,null,{"$f":"corner_1_sash!$C$145","v":"Accessory kit installation"},null,"612 010.0000.000",{"$nulls":3},1,{"$f":"corner_1_sash!$J$145","v":"piece"}]
[]
[null,null,{"$f":"corner_1_sash!$C$148","v":"Sealing strips (optional, please see above to select or deselect)"}]
[]
[null,null,{"$f":"corner_1_sash!$C$150","v":"Description"},null,{"$f":"corner_1_sash!$E$150","v":"Article number"},{"$nulls":3},{"$f":"corner_1_sash!$I$150","v":"Quantity"},{"$f":"corner_1_sash!$J$150","v":"Unit"},{"$f":"corner_1_sash!$K$150","v":"Sales length"},{"$f":"corner_1_sash!$L$150","v":"Cut length*"}]
[null,null,{"$f":"corner_2_sashes_on_one_side!C195","v":"Magnetic seals 180°"},null,{"$f":"\"612 430.\"&K154&\".305\"","v":"612 430.2000.305"},{"$nulls":3},{"$f":"IF(N2_Wahl_Dichtl_schließseitig =\"Yes\",1,0)","v":1},{"$f":"corner_2_sashes_on_one_side!J195","v":"pair"},{"$f":"VLOOKUP(L154,$E$226:$I$227,2,TRUE)","v":{"v":2000,"d":"2,000 mm"}},{"$f":"N2_HS","v":{"v":1970,"d":"1,970 mm"}}]
[null,null,{"$f":"corner_1_sash!$C$152","v":"Vertical sealing strips between fixed and sliding sash"},null,{"$f":"\"612 440.\"&K155&\".305\"","v":"612 440.2000.305"},{"$nulls":3},{"$f":"IF(N2_Wahl_Dichtl_F_u_S=\"Yes\", 2,0)","v":0},{"$f":"corner_1_sash!$J$152","v":"pair"},{"$f":"VLOOKUP(L155,$E$226:$I$227,2,TRUE)","v":{"v":2000,"d":"2,000 mm"}},{"$f":"N2_HF-24","v":{"v":1934,"d":"1,934 mm"}}]
[]
[null,null,{"$f":"corner_1_sash!$C$154","v":"Threshold profile (optional, please see above to select or deselect)"}]
[]
[null,null,{"$f":"corner_1_sash!$C$156","v":"Description"},null,{"$f":"corner_1_sash!$E$156","v":"Article number"},{"$nulls":3},{"$f":"corner_1_sash!$I$156","v":"Quantity"},{"$f":"corner_1_sash!$J$156","v":"Unit"},{"$f":"corner_1_sash!$K$156","v":"Sales length"},{"$f":"corner_1_sash!$L$156","v":"Cut length*"}]
[null,null,{"$f":"corner_2_sashes_on_one_side!C201","v":"Threshold profile, cut straight, gloss-polished aluminium"},null,"612 450.1000.111",{"$nulls":3},{"$f":"IF(N2_Wahl_Schwallschutz=\"Yes, made of gloss-polished aluminium\",IF(L160<=1000,1,2),0)","v":0},{"$f":"corner_1_sash!$J$157","v":"piece"},{"v":1000,"d":"1,000 mm"},{"$f":"N2_LWt+2*N2_WSZ_final","v":{"v":1024,"d":"1,024 mm"}}]
[null,null,{"$f":"corner_2_sashes_on_one_side!C202","v":"Threshold profile, cut straight, transparent plastic"},null,"612 450.1000.305",{"$nulls":3},{"$f":"IF(N2_Wahl_Schwallschutz=\"Yes, made of transparent plastic\",IF(L160<=1000,1,2),0)","v":0},{"$f":"corner_1_sash!$J$158","v":"piece"},{"v":1000,"d":"1,000 mm"},{"$f":"N2_LWt+2*N2_WSZ_final","v":{"v":1024,"d":"1,024 mm"}}]
[]
[null,null,{"$f":"corner_1_sash!$C$160","v":"Wall profile (optional, please see above to select or deselect)"}]
[]
[null,null,{"$f":"corner_1_sash!$C$162","v":"Description"},null,{"$f":"corner_1_sash!$E$162","v":"Article number"},{"$nulls":3},{"$f":"corner_1_sash!$I$162","v":"Quantity"},{"$f":"corner_1_sash!$J$162","v":"Unit"},{"$f":"corner_1_sash!$K$162","v":"Sales length"},{"$f":"corner_1_sash!$L$162","v":"Cut length*"}]
[null,null,{"$f":"corner_1_sash!$C$163","v":"Wall profile incl. plastic insert"},null,{"$f":"\"612 520.\"&K166&\".111\"","v":"612 520.2000.111"},{"$nulls":3},{"$f":"IF(N2_Wahl_Wandanschluss=\"Profile\",2,0)","v":0},{"$f":"corner_1_sash!$J$163","v":"piece"},{"$f":"VLOOKUP(L166,$E$226:$I$227,2,TRUE)","v":{"v":2000,"d":"2,000 mm"}},{"$f":"N2_H-50","v":{"v":1950,"d":"1,950 mm"}}]
[]
[null,null,{"$f":"corner_1_sash!$C$165","v":"Floor profile (optional, please see above to select or deselect)"}]
[]
[null,null,{"$f":"corner_1_sash!$C$167","v":"Description"},null,{"$f":"corner_1_sash!$E$167","v":"Article number"},{"$nulls":3},{"$f":"corner_1_sash!$I$167","v":"Quantity"},{"$f":"corner_1_sash!$J$167","v":"Unit"},{"$f":"corner_1_sash!$K$167","v":"Sales length"}]
[null,null,{"$f":"corner_1_sash!$C$168","v":"Floor profile length 1000 mm"},null,{"$f":"\"612 530.\"&K171&\".111\"","v":"612 530.1000.111"},{"$nulls":3},{"$f":"IF(N2_Wahl_Bodenprofil=\"Yes\",L185,0)","v":0},{"$f":"corner_1_sash!$J$168","v":"piece"},{"v":1000,"d":"1,000 mm"}]
[null,null,{"$f":"corner_1_sash!$C$169","v":"Floor profile length 1500 mm"},null,{"$f":"\"612 530.\"&K172&\".111\"","v":"612 530.1500.111"},{"$nulls":3},{"$f":"IF(N2_Wahl_Bodenprofil=\"Yes\",M185,0)","v":0},{"$f":"corner_1_sash!$J$169","v":"piece"},{"v":1500,"d":"1,500 mm"}]
[]
[null,null,{"$f":"corner_1_sash!$C$171","v":"Description"},null,{"$f":"corner_1_sash!$E$171","v":"Glass width of fixed sashes"}]
[null,null,{"$f":"corner_2_sashes_on_one_side!C216","v":"Approximate required length of floor profile for fixed sash 1.1"},null,{"$f":"N2_WF1.1","v":{"v":485,"d":"485 mm"}},{"$nulls":8},{"$f":"corner_1_sash!N212","v":"* With exactly vertical walls and horizontal floors."}]
[null,null,{"$f":"corner_2_sashes_on_one_side!C217","v":"Approximate required length of floor profile for fixed sash 1.2"},null,{"$f":"N2_WF1.2","v":{"v":485,"d":"485 mm"}}]
[null,null,{"$f":"corner_1_sash!$C$174","v":"Approximate required total length of floor profile"},null,{"$f":"SUM(E175:H176)","v":{"v":970,"d":"970 mm"}}]
[]
[null,null,"Kaufvarianten"]
[]
[{"$nulls":11},"Im Minimum-Fall"]
[null,null,"Zusammenfassung",{"$nulls":5},"Preis Summe","Mögl.?","Minimum und möglich?","Anzahl 1000 mm","Anzahl 1500 mm"]
[null,null,{"$f":"C187","v":"Variante 1: Alle einzeln"},{"$nulls":5},{"$f":"IF(J183=\"Ja\",M190,\"n.a.\")","v":{"v":64.44,"d":"64"}},{"$f":"E198","v":"Ja"},{"$f":"IF(AND(I183=MIN($I$183:$I$184),J183=\"Ja\"),\"Ja\",\"Nein\")","v":"Nein"},{"$f":"IF(K183=\"Ja\",I188,0)","v":0},{"$f":"IF(K183=\"Ja\",I189,0)","v":0}]
[null,null,{"$f":"C200","v":"Variante 2: Alle zusammen"},{"$nulls":5},{"$f":"IF(J184=\"Ja\",M203,\"n.a.\")","v":{"v":32.22,"d":"32"}},{"$f":"E211","v":"Ja"},{"$f":"IF(AND(I184=MIN($I$183:$I$184),J184=\"Ja\"),\"Ja\",\"Nein\")","v":"Ja"},{"$f":"IF(K184=\"Ja\",I201,0)","v":1},{"$f":"IF(K184=\"Ja\",I202,0)","v":0}]
[{"$nulls":11},{"$f":"SUM(L183:L184)","v":1},{"$f":"SUM(M183:M184)","v":0}]
[]
[null,null,"Variante 1: Alle einzeln",null,"Artikelnummer",{"$nulls":3},"Anzahl","Einheit","Verkaufslänge","Brutto-VK-Preis","Summe Brutto-VK-Preis"]
[null,null,"Anzahl benötigter Bodenprofile in Länge 1000 mm",null,{"$f":"\"612 XXX.\"&K188&\".111\"","v":"612 XXX.1000.111"},{"$nulls":3},{"$f":"COUNTIF(H193:I$195,K188)","v":2},"Stück",{"v":1000,"d":"1,000 mm"},{"$f":"F232","v":{"v":32.22,"d":"32.22 €"}},{"$f":"I188*L188","v":{"v":64.44,"d":"64.44 €"}}]
[null,null,"Anzahl benötigter Bodenprofile in Länge 1500 mm",null,{"$f":"\"612 XXX.\"&K189&\".111\"","v":"612 XXX.1500.111"},{"$nulls":3},{"$f":"COUNTIF(H193:I195,K189)","v":0},"Stück",{"v":1500,"d":"1,500 mm"},{"$f":"F233","v":{"v":48.33,"d":"48.33 €"}},{"$f":"I189*L189","v":0}]
[{"$nulls":12},{"$f":"M188+M189","v":{"v":64.44,"d":"64.44 €"}}]
[]
[{"$nulls":4},"Länge ben.",{"$nulls":3},"Verkaufslänge"]
[null,null,{"$f":"C175","v":"Approximate required length of floor profile for fixed sash 1.1"},null,{"$f":"E175","v":{"v":485,"d":"485 mm"}},{"$nulls":3},{"$f":"IF(E193<=1500,VLOOKUP(E193,$E$229:$I$230,2,TRUE),\"nicht vorhanden\")","v":{"v":1000,"d":"1,000 mm"}}]
[null,null,{"$f":"C176","v":"Approximate required length of floor profile for fixed sash 1.2"},null,{"$f":"N2_WF1.2","v":{"v":485,"d":"485 mm"}},{"$nulls":3},{"$f":"IF(E194<=1500,VLOOKUP(E194,$E$229:$I$230,2,TRUE),\"nicht vorhanden\")","v":{"v":1000,"d":"1,000 mm"}}]
[]
[null,null,"Summe",null,{"$f":"SUM(E193:F195)","v":{"v":970,"d":"970 mm"}}]
[]
[null,null,"Ist die Variante eine mögliche Lösung?",null,{"$f":"IF(OR(I193=\"nicht vorhanden\",I194=\"nicht vorhanden\",I195=\"nicht vorhanden\"),\"Nein\",\"Ja\")","v":"Ja"}]
[]
[null,null,"Variante 2: Alle zusammen",null,"Artikelnummer",{"$nulls":3},"Anzahl","Einheit","Verkaufslänge","Brutto-VK-Preis","Summe Brutto-VK-Preis"]
[null,null,"Anzahl benötigter Bodenprofile in Länge 1000 mm",null,{"$f":"\"612 XXX.\"&K201&\".111\"","v":"612 XXX.1000.111"},{"$nulls":3},{"$f":"COUNTIF($H$206:$I$208,K201)","v":1},"Stück",{"v":1000,"d":"1,000 mm"},{"$f":"F232","v":{"v":32.22,"d":"32.22 €"}},{"$f":"I201*L201","v":{"v":32.22,"d":"32.22 €"}}]
[null,null,"Anzahl benötigter Bodenprofile in Länge 1500 mm",null,{"$f":"\"612 XXX.\"&K202&\".111\"","v":"612 XXX.1500.111"},{"$nulls":3},{"$f":"COUNTIF($H$206:$I$208,K202)","v":0},"Stück",{"v":1500,"d":"1,500 mm"},{"$f":"F233","v":{"v":48.33,"d":"48.33 €"}},{"$f":"I202*L202","v":0}]
[{"$nulls":12},{"$f":"M201+M202","v":{"v":32.22,"d":"32.22 €"}}]
[]
[{"$nulls":4},"Länge ben.",{"$nulls":3},"Verkaufslänge"]
[null,null,"Ungefähr benötigte Länge an Bodenprofil für alle zusammen",null,{"$f":"E177","v":{"v":970,"d":"970 mm"}},{"$nulls":3},{"$f":"IF(E206<=1500,VLOOKUP(E206,$E$229:$I$230,2,TRUE),\"nicht vorhanden\")","v":{"v":1000,"d":"1,000 mm"}}]
[]
[]
[null,null,"Summe",null,{"$f":"SUM(E206:F208)","v":{"v":970,"d":"970 mm"}}]
[]
[null,null,"Ist die Variante eine mögliche Lösung?",null,{"$f":"IF(OR(I206=\"nicht vorhanden\",I207=\"nicht vorhanden\",I208=\"nicht vorhanden\"),\"Nein\",\"Ja\")","v":"Ja"}]
[]
[null,null,{"$f":"corner_1_sash!$C$210","v":"Finger pull handle (optional, please see above to select or deselect)"},{"$nulls":10},{"$f":"recess_1_sash!N156","v":"** We recommend that you deduct an additional 2 mm so that the profile can be inserted between the walls."}]
[]
[null,null,{"$f":"corner_1_sash!$C$212","v":"Description"},null,{"$f":"corner_1_sash!$E$212","v":"Article number"},{"$nulls":3},{"$f":"corner_1_sash!$I$212","v":"Quantity"},{"$f":"corner_1_sash!$J$212","v":"Unit"}]
[null,null,{"$f":"corner_1_sash!$C$213","v":"Round finger pull handle, diameter 39 mm (diameter of glass drill hole 10 mm), 1 pair for 1 sash (inside and outside), stainless steel"},null,"612 267.0000.020",{"$nulls":3},{"$f":"IF(N2_Wahl_Griff=\"Yes\",2,0)","v":2},{"$f":"corner_1_sash!$J$213","v":"pair"}]
[]
[]
[null,null,"Tabelle Profillängen"]
[{"$nulls":3},"Laufschiene/Blende",0,950,null,null,950,null,"mm"]
[{"$nulls":4},950.01,1150,null,null,1150,null,"mm"]
[{"$nulls":4},1150.01,1550,null,null,1550,null,"mm"]
[{"$nulls":4},1550.01,2050,null,null,2050,null,"mm"]
[{"$nulls":4},2050.01,4880,null,null,4880,null,"mm"]
[]
[{"$nulls":3},"Wandprofil/Dichtleisten",0,2000,null,null,2000,null,"mm"]
[{"$nulls":4},2000.01,2490,null,null,2490,null,"mm"]
[]
[{"$nulls":3},"Bodenprofil",0,1000,null,null,1000,null,"mm"]
[{"$nulls":4},1000.01,1500,null,null,1500,null,"mm"]
[]
[{"$nulls":3},"Brutto-VK-Bodenprofil",1000,32.22]
[{"$nulls":4},1500,48.33]
[]
[]
[null,{"$f":"Haftungsausschluss","v":"Willach assumes no liability for damage of any kind that could arise as a result of using this profile and glass dimensions calculator. (11.05.2016 Rev. 3)"}]

{"sheet":"U-shower_1_sash_front","index":6,"n_rows":289,"n_cols":17,"rows_kept":289,"merged":[[0,1,0,14],[3,1,3,17],[4,1,26,17],[28,1,28,5],[28,7,28,17],[29,8,58,11],[29,12,29,17],[30,12,30,17],[31,12,31,17],[32,12,32,17],[33,12,33,17],[34,12,34,17],[35,12,35,17],[36,12,36,17],[37,12,37,17],[38,2,39,3],[38,4,39,4],[38,12,38,17],[39,12,39,17],[40,12,58,17],[41,2,42,3],[41,4,42,4],[44,2,45,3],[44,4,45,4],[47,2,48,3],[50,3,50,4],[53,2,54,3],[53,4,54,4],[56,2,57,3],[56,4,57,4],[60,1,60,16],[63,1,63,17],[65,2,65,5],[65,7,65,16],[67,7,67,10],[69,7,69,10],[71,7,71,10],[73,7,73,10],[75,7,75,10],[77,7,77,10],[79,7,79,10],[81,7,81,10],[91,2,92,16],[95,1,95,5],[95,7,95,17],[97,8,97,16],[99,9,99,10],[103,2,104,4],[103,9,103,10],[107,8,108,8],[107,9,108,10],[107,11,108,11],[107,12,108,12],[107,13,108,13],[107,14,108,14],[107,16,108,16],[112,9,112,10],[113,8,113,16],[115,8,117,16],[124,2,124,4],[136,2,136,4],[141,1,141,16],[143,1,143,17],[145,2,145,3],[147,2,147,3],[147,4,147,7],[147,11,147,12],[147,14,147,16],[148,2,148,3],[148,4,148,7],[148,11,148,12],[149,2,149,3],[149,4,149,7],[149,11,149,12],[150,2,150,3],[150,4,150,7],[150,11,150,12],[151,4,151,7],[151,11,152,12],[153,2,153,3],[155,2,155,3],[155,4,155,7],[155,11,155,12],[155,14,155,16],[156,2,156,3],[156,4,156,7],[157,2,157,3],[157,4,157,7],[158,2,158,3],[158,4,158,7],[159,2,159,3],[159,4,159,7],[161,2,161,12],[163,2,163,3],[163,4,163,7],[163,11,163,12],[163,14,163,16],[164,2,164,3],[164,4,164,7],[164,11,164,12],[165,2,165,3],[165,4,165,7],[165,11,165,12],[167,2,167,12],[169,2,169,3],[169,4,169,7],[169,11,169,12],[169,14,169,16],[170,2,170,3],[170,4,170,7],[170,11,170,12],[171,2,171,3],[171,4,171,7],[171,11,171,12],[173,2,173,12],[175,2,175,3],[175,4,175,7],[175,11,175,12],[175,14,175,16],[176,2,176,3],[176,4,176,7],[176,11,176,12],[178,2,178,12],[180,2,180,3],[180,4,180,7],[181,2,181,3],[181,4,181,7],[182,2,182,3],[182,4,182,7],[184,2,184,3],[184,4,184,7],[184,11,184,12],[185,2,185,3],[185,4,185,7],[185,11,185,12],[186,2,186,3],[186,4,186,7],[187,2,187,3],[187,4,187,7],[187,11,187,12],[188,2,188,3],[188,4,188,7],[190,2,190,3],[192,11,192,12],[193,2,193,3],[193,5,193,7],[194,2,194,3],[195,2,195,3],[196,2,196,3],[197,2,197,3],[198,2,198,3],[200,2,200,3],[201,2,201,3],[201,4,201,7],[202,2,202,3],[202,4,202,7],[203,2,203,3],[203,4,203,7],[206,4,206,5],[206,8,206,9],[207,2,207,3],[207,4,207,5],[207,8,207,9],[208,2,208,3],[208,4,208,5],[208,8,208,9],[209,2,209,3],[209,4,209,5],[209,8,209,9],[210,2,210,3],[210,4,210,5],[211,8,211,9],[212,2,212,3],[212,8,212,9],[213,2,213,3],[214,2,214,3],[214,4,214,7],[215,2,215,3],[215,4,215,7],[216,2,216,3],[216,4,216,7],[219,4,219,5],[219,8,219,9],[220,2,220,3],[220,4,220,5],[220,8,220,9],[221,2,222,3],[221,4,221,5],[221,8,221,9],[222,4,222,5],[222,8,222,9],[223,2,223,3],[223,4,223,5],[225,2,225,3],[227,2,227,3],[227,4,227,7],[228,2,228,3],[228,4,228,7],[229,2,229,3],[229,4,229,7],[232,4,232,5],[232,8,232,9],[233,2,233,3],[233,4,233,5],[233,8,233,9],[234,2,235,3],[234,4,234,5],[234,8,234,9],[235,4,235,5],[235,8,235,9],[236,2,236,3],[236,4,236,5],[238,2,238,3],[240,2,240,3],[240,4,240,7],[241,2,241,3],[241,4,241,7],[242,2,242,3],[242,4,242,7],[245,4,245,5],[245,8,245,9],[246,2,246,3],[246,4,246,5],[246,8,246,9],[247,2,248,3],[247,4,247,5],[247,8,247,9],[248,4,248,5],[248,8,248,9],[249,2,249,3],[249,4,249,5],[251,2,251,3],[253,2,253,3],[253,4,253,7],[254,2,254,3],[254,4,254,7],[255,2,255,3],[255,4,255,7],[258,4,258,5],[258,8,258,9],[259,2,259,3],[259,4,259,5],[259,8,259,9],[260,2,261,3],[260,4,260,5],[260,8,260,9],[261,4,261,5],[261,8,261,9],[262,2,262,3],[262,4,262,5],[264,2,264,3],[266,2,266,3],[268,2,268,3],[268,4,268,7],[268,13,269,16],[269,2,269,3],[269,4,269,7],[272,2,272,16],[288,1,288,16]]}
[null,"Aquant 40: U-shower with 1 sliding sash, door at the front"]
[]
[]
[null,{"$f":"corner_1_sash!B4","v":"Drawings"}]
{"$rows_empty":24}
[null,{"$f":"corner_1_sash!B29","v":"User input"},{"$nulls":5},{"$f":"corner_1_sash!H29","v":"Legend & Formulas"}]
[{"$nulls":8},"Legend\nW1 = System width of side 1\nW2 = System width of side 2\nH = System height\nLS1 = Length of track profile/cover profile 1\nLS2 = Length of track profile/cover profile 2\nLS3 = Length of track profile/cover profile 3\nLWt = Clearance with open door\n\nWS2 = Glass width of sliding sash 2 with handle\nWSZ = Additional width of sliding sash for handle\nHS2 = Glass height of sliding sash 2\n\nWF1 = Glass width of fixed sash 1\nWF2 = Glass width of fixed sash 2\nWF3 = Glass width of fixed sash 3\nWFA = Allowance for fixed sash for wall attachment\nWFZ2 = Additional width of fixed sash 2\nHF1 = Glass height of fixed sash 1\nHF2 = Glass height of fixed sash 2\nHF3 = Glass height of fixed sash 3\n\nUF = Overlap between sliding sash and fixed sash\n\nSMs = Size of gap on the closing side\nSMo2 = Size of gap on the opening side for sliding sash 2",{"$nulls":3},"Formulas"]
[null,null,"W1",{"$f":"corner_1_sash!D31","v":"System width of side 1 (max. 1,500 mm)"},{"v":1200,"d":"1,200"},"(mm)",{"$nulls":6},{"$f":"\"WS2 = (W2 - WFZ2 + WSZ + UF - SMs - \"&U1_Glasstärke&\") / 2\"","v":"WS2 = (W2 - WFZ2 + WSZ + UF - SMs - 8) / 2"}]
[{"$nulls":12},{"$f":"\"WF1 = W1 - WFA - \"&I90","v":"WF1 = W1 - WFA - 11"}]
[null,null,"W2",{"$f":"corner_1_sash!D33","v":"System width of side 2 (max. 1,500 mm)"},{"v":1200,"d":"1,200"},"(mm)",{"$nulls":6},"WF2 = WS2 - WSZ + WFZ2"]
[{"$nulls":12},"WF3 = W1 - WFA"]
[null,null,"H",{"$f":"corner_1_sash!D35","v":"System height (max. 2,500 mm)"},{"v":2000,"d":"2,000"},"(mm)",{"$nulls":6},{"$f":"\"HS2 = H - \"&U1_HSA_System","v":"HS2 = H - 30"}]
[{"$nulls":12},{"$f":"\"HF1 = HF2 = HF3 = H - \"&U1_HFA_System","v":"HF1 = HF2 = HF3 = H - 42"}]
[null,null,"WFZ2","Additional width of fixed sash 2",38,"(mm)",{"$nulls":6},{"$f":"\"SMo2 = WFZ2 - \"&U1_Glasstärke","v":"SMo2 = WFZ2 - 8"}]
[{"$nulls":12},{"$f":"\"LS1 = LS3 = W1 - \"&U1_Eckstück","v":"LS1 = LS3 = W1 - 49"}]
[null,null,"Do you wish to attach the fixed sash to the wall via a wall profile or directly via silicon?",null,"Silicon",{"$nulls":7},{"$f":"\"LS 2 = W2 - \"&I86","v":"LS 2 = W2 - 98"}]
[{"$nulls":12},{"$f":"\"LWt = W2 -  WF2 - WSZ - \"&U1_Glasstärke","v":"LWt = W2 -  WF2 - WSZ - 8"}]
[]
[null,null,"Do you wish to use the Aquant floor profile?",null,"No"]
[]
[]
[null,null,"Do you wish to use vertical sealing strips between fixed and sliding sash?",null,"No"]
[]
[]
[null,null,"Do you wish to use an optional threshold profile in the door area (in addition to the obligatory drip rail)?"]
[]
[]
[{"$nulls":3},"No"]
[]
[]
[null,null,"Do you wish to use the Aquant bulb seal?",null,"Yes"]
[]
[]
[null,null,"Do you wish to use the Aquant finger pull handle?",null,"Yes"]
[]
[]
[]
[null,{"$f":"Haftungsausschluss","v":"Willach assumes no liability for damage of any kind that could arise as a result of using this profile and glass dimensions calculator. (11.05.2016 Rev. 3)"}]
[]
[]
[null,{"$f":"corner_1_sash!B63","v":"System dimensions"}]
[]
[null,null,{"$f":"corner_1_sash!C65","v":"System dimensions specified/recommended by Willach"},{"$nulls":4},{"$f":"corner_1_sash!H65","v":"Deviations from system dimensions"}]
[]
[null,null,"HSA",{"$f":"corner_1_sash!D67","v":"Höhenabzugsmaß für Aufnahme Schiebeflügel"},30,"(mm)",null,{"$f":"corner_1_sash!H67","v":"Deviation from system dimension?"},{"$nulls":3},{"$f":"IF(OR(U1_HSA_Wunsch=\"\",U1_HSA_Wunsch=U1_HSA_System),\"Nein\",\"Ja\")","v":"Nein"},{"$f":"corner_1_sash!M67","v":"Desired value"},null,null,{"$f":"IF(OR(L68=\"Nein\",O68=\"\"),E68,O68)","v":30},"(mm)"]
[]
[null,null,"WSZ",{"$f":"corner_1_sash!D69","v":"Additional width of sliding sash for handle"},69,"(mm)",null,{"$f":"corner_1_sash!H69","v":"Deviation from system dimension?"},{"$nulls":3},{"$f":"IF(OR(U1_WSZ_Wunsch=\"\",U1_WSZ_Wunsch=U1_WSZ_System),\"Nein\",\"Ja\")","v":"Nein"},{"$f":"corner_1_sash!M69","v":"Desired value"},null,null,{"$f":"IF(OR(L70=\"Nein\",O70=\"\"),E70,O70)","v":69},"(mm)"]
[]
[null,null,"WFA",{"$f":"corner_1_sash!D71","v":"Allowance for fixed sash for wall attachment"},{"$f":"IF(E39=\"Profile\",14,3)","v":3},"(mm)",null,{"$f":"corner_1_sash!H71","v":"Deviation from system dimension?"},{"$nulls":3},{"$f":"IF(OR(U1_WFA_Wunsch=\"\",U1_WFA_Wunsch=U1_WFA_System),\"Nein\",\"Ja\")","v":"Nein"},{"$f":"corner_1_sash!M71","v":"Desired value"},null,null,{"$f":"IF(OR(L72=\"Nein\",O72=\"\"),E72,O72)","v":3},"(mm)"]
[]
[null,null,"HFA",{"$f":"corner_1_sash!D73","v":"Höhenabzugsmaß für Aufnahme Festflügel"},42,"(mm)",null,{"$f":"corner_1_sash!H73","v":"Deviation from system dimension?"},{"$nulls":3},{"$f":"IF(OR(U1_HFA_Wunsch=\"\",U1_HFA_Wunsch=U1_HFA_System),\"Nein\",\"Ja\")","v":"Nein"},{"$f":"corner_1_sash!M73","v":"Desired value"},null,null,{"$f":"IF(OR(L74=\"Nein\",O74=\"\"),E74,O74)","v":42},"(mm)"]
[]
[null,null,"UF",{"$f":"corner_1_sash!D75","v":"Overlap between sliding sash and fixed sash"},{"$f":"IF(E45=\"Yes\",5,35)","v":35},"(mm)",null,{"$f":"corner_1_sash!H75","v":"Deviation from system dimension?"},{"$nulls":3},{"$f":"IF(OR(U1_UF_Wunsch=\"\",U1_UF_Wunsch=U1_UF_System),\"Nein\",\"Ja\")","v":"Nein"},{"$f":"corner_1_sash!M75","v":"Desired value"},null,null,{"$f":"IF(OR(L76=\"Nein\",O76=\"\"),E76,O76)","v":35},"(mm)"]
[]
[null,null,"SMs",{"$f":"corner_1_sash!D77","v":"Size of gap on the closing side"},14,"(mm)",null,{"$f":"corner_1_sash!H77","v":"Deviation from system dimension?"},{"$nulls":3},{"$f":"IF(OR(U1_SMs_Wunsch=\"\",U1_SMs_Wunsch=U1_SMs_System),\"Nein\",\"Ja\")","v":"Nein"},{"$f":"corner_1_sash!M77","v":"Desired value"},null,null,{"$f":"IF(OR(L78=\"Nein\",O78=\"\"),E78,O78)","v":14},"(mm)"]
[]
[null,null,"SMo",{"$f":"corner_1_sash!D79","v":"Vorgabe Mindest-Spaltmaß öffnungsseitig"},30,"(mm)",null,{"$f":"corner_1_sash!H79","v":"Deviation from system dimension?"},{"$nulls":3},{"$f":"IF(OR(U1_SMo_Wunsch=\"\",U1_SMo_Wunsch=U1_SMo_System),\"Nein\",\"Ja\")","v":"Nein"},{"$f":"corner_1_sash!M79","v":"Desired value"},null,null,{"$f":"IF(OR(L80=\"Nein\",O80=\"\"),E80,O80)","v":30},"(mm)"]
[]
[{"$nulls":3},{"$f":"corner_1_sash!D81","v":"Weight of Aquant handle"},0.2,"(kg)",null,{"$f":"corner_1_sash!H81","v":"Deviation from system dimension?"},{"$nulls":3},{"$f":"IF(OR(U1_Gewicht_Griff_Wunsch=\"\",U1_Gewicht_Griff_Wunsch=U1_Gewicht_Griff_System),\"Nein\",\"Ja\")","v":"Nein"},{"$f":"corner_1_sash!M81","v":"Desired value"},null,null,{"$f":"IF(OR(L82=\"Nein\",O82=\"\"),E82,O82)","v":0.2},"(kg)"]
[]
[{"$nulls":3},"Glasstärke",8,"(mm)"]
[]
[{"$nulls":3},"Eckenabzug",49,"(mm)",null,null,{"$f":"2*U1_Eckstück","v":98}]
[]
[{"$nulls":3},"Glasscheibenabstand",15,"(mm)"]
[]
[{"$nulls":3},"Silikon zw. zwei Festflügeln",3,"(mm)",null,null,{"$f":"U1_Glasstärke+E90","v":11}]
[]
[null,null,{"$f":"IF(OR(L68=\"Ja\",L72=\"Ja\",L74=\"Ja\",L76=\"Ja\",L78=\"Ja\",L80=\"Ja\",L70=\"Ja\",L82=\"Ja\"),\"Caution: you are deviating from the suggested system dimension, please check whether the system can be built with the value you have selected!\",\"\")","v":""}]
[]
[]
[]
[null,{"$f":"corner_1_sash!B93","v":"Automatic calculation of glass dimensions and profile lengths*"},{"$nulls":5},{"$f":"corner_1_sash!H93","v":"Automatic check of door sash width, sash weight, aspect ratio and gap dimension on the opening side"}]
[]
[null,null,"Glass dimensions of sliding sash 2",{"$nulls":5},{"$f":"corner_1_sash!I95","v":"Check of the door sash width"}]
[]
[null,null,"WS2","Glass width of sliding sash 2 with handle",{"$f":"(U1_W2-U1_WFZ2+U1_WSZ_final+U1_UF_final-U1_SMs_final-U1_Glasstärke)/2","v":622},"(mm)",null,null,"WS2",{"$f":"D100","v":"Glass width of sliding sash 2 with handle"},null,{"$f":"U1_WS2","v":622},"≥",380,"(mm)",null,{"$f":"IF(L100>=N100,\"Yes\",\"No\")","v":"Yes"}]
[]
[null,null,"HS2","Glass height of sliding sash 2",{"$f":"U1_H-U1_HSA_final","v":{"v":1970,"d":"1,970"}},"(mm)",null,null,{"$f":"corner_1_sash!I99","v":"Check of the sash weight"}]
[]
[null,null,"Please note that drill holes are required, please refer to the relevant drilling drawings!",{"$nulls":6},"Weight of sliding sash 2",null,{"$f":"ROUND(U1_WS2/1000*U1_HS/1000*2.5*U1_Glasstärke+U1_Griff_final,0)","v":25},"≤",40,"(kg)",null,{"$f":"IF(L104<=N104,\"Yes\",\"No\")","v":"Yes"}]
[]
[{"$nulls":8},{"$f":"corner_1_sash!I103","v":"Check of the aspect ratio"}]
[null,null,"Glass dimensions of fixed sash 1"]
[{"$nulls":9},"Height-to-width ratio of sliding sash 2",null,{"$f":"ROUND(U1_HS/U1_WS2,2)","v":3.17},"≤",5,null,null,{"$f":"IF(L108<=N108,\"Yes\",\"No\")","v":"Yes"}]
[null,null,"WF1","Glass width of fixed sash 1",{"$f":"U1_W1-U1_WFA_final-U1_Glasstärke-E90","v":{"v":1186,"d":"1,186"}},"(mm)"]
[]
[null,null,"HF1","Glass height of fixed sash 1",{"$f":"U1_H-U1_HFA_final","v":{"v":1958,"d":"1,958"}},"(mm)",null,null,{"$f":"corner_1_sash!I108","v":"Check of the gap dimension on the opening side"}]
[]
[null,null,"Glass dimensions of fixed sash 2",{"$nulls":5},{"$f":"C80&2","v":"SMo2"},{"$f":"'corner_2_sashes_corner entry'!J120:K120","v":" Gap dimension on the opening side for sliding sash 2"},null,{"$f":"U1_WFZ2-U1_Glasstärke","v":30},"≥",{"$f":"P80","v":30},"(mm)",null,{"$f":"IF(L113>=N113,\"Yes\",\"No\")","v":"Yes"}]
[{"$nulls":8},{"$f":"IF(Q113=\"No\",\"Note: if the gap on the opening side is too small , please increase WFZ2.\",\"\")","v":""}]
[null,null,"WF2","Glass width of fixed sash 2",{"$f":"U1_WS2-U1_WSZ_final+U1_WFZ2","v":591},"(mm)"]
[{"$nulls":8},{"$f":"IF(OR(Q100=\"No\",Q104=\"No\",Q108=\"No\",Q113=\"No\",),\"Caution: the technical restrictions have not been observed; please change your planning!\",\"\")","v":""}]
[null,null,"HF2","Glass height of fixed sash 2",{"$f":"U1_HF","v":{"v":1958,"d":"1,958"}},"(mm)"]
[]
[null,null,"Glass dimensions of fixed sash 3"]
[]
[null,null,"WF3","Glass width of fixed sash 3",{"$f":"U1_W1-U1_WFA_final","v":{"v":1197,"d":"1,197"}},"(mm)"]
[]
[null,null,"HF3","Glass height of fixed sash 3",{"$f":"U1_HF","v":{"v":1958,"d":"1,958"}},"(mm)"]
[]
[null,null,"Length of track profile/cover profile 1"]
[]
[null,null,"LS1","Length of track profile/cover profile 1",{"$f":"U1_W1-U1_Eckstück","v":{"v":1151,"d":"1,151"}},"(mm)"]
[]
[null,null,"Length of track profile/cover profile 2"]
[]
[null,null,"LS2","Length of track profile/cover profile 2",{"$f":"U1_W2-(2*U1_Eckstück)","v":{"v":1102,"d":"1,102"}},"(mm)"]
[]
[null,null,"Length of track profile/cover profile 3"]
[]
[null,null,"LS3","Length of track profile/cover profile 3",{"$f":"U1_LS1","v":{"v":1151,"d":"1,151"}},"(mm)"]
[]
[null,null,{"$f":"corner_1_sash!C124","v":"For information: clearance with open door"}]
[]
[null,null,"LWt",{"$f":"corner_1_sash!D126","v":"Clearance with open door"},{"$f":"U1_W2-U1_WF2-U1_WSZ_final-U1_Glasstärke","v":532},"(mm)"]
[]
[]
[null,{"$f":"Haftungsausschluss","v":"Willach assumes no liability for damage of any kind that could arise as a result of using this profile and glass dimensions calculator. (11.05.2016 Rev. 3)"}]
[]
[null,{"$f":"corner_1_sash!B131","v":"Order list"}]
[]
[null,null,{"$f":"corner_1_sash!C133","v":"Profile sets"}]
[]
[null,null,{"$f":"corner_1_sash!C135","v":"Description"},null,{"$f":"corner_1_sash!E135","v":"Article number"},{"$nulls":3},{"$f":"corner_1_sash!I135","v":"Quantity"},{"$f":"corner_1_sash!J135","v":"Unit"},{"$f":"corner_1_sash!K135","v":"Sales length"},{"$f":"corner_1_sash!L135","v":"Cut length*"}]
[null,null,{"$f":"corner_1_sash!C136","v":"Profile set for side 1"},null,{"$f":"IF(K149<1000,\"612 070.0\"&K149&\".111\",\"612 070.\"&K149&\".111\")","v":"612 070.1550.111"},{"$nulls":3},1,{"$f":"corner_1_sash!J136","v":"piece"},{"$f":"VLOOKUP(L149,$E$274:$I$278,2,TRUE)","v":{"v":1550,"d":"1,550 mm"}},{"$f":"U1_LS1","v":{"v":1151,"d":"1,151 mm"}}]
[null,null,{"$f":"corner_1_sash!C137","v":"Profile set for side 2"},null,{"$f":"IF(K150<1000,\"612 070.0\"&K150&\".111\",\"612 070.\"&K150&\".111\")","v":"612 070.1150.111"},{"$nulls":3},1,{"$f":"J149","v":"piece"},{"$f":"VLOOKUP(L150,$E$274:$I$278,2,TRUE)","v":{"v":1150,"d":"1,150 mm"}},{"$f":"U1_LS2","v":{"v":1102,"d":"1,102 mm"}}]
[null,null,"Profile set for side 3",null,{"$f":"IF(K151<1000,\"612 070.0\"&K151&\".111\",\"612 070.\"&K151&\".111\")","v":"612 070.1550.111"},{"$nulls":3},1,{"$f":"J149","v":"piece"},{"$f":"VLOOKUP(L151,$E$274:$I$278,2,TRUE)","v":{"v":1550,"d":"1,550 mm"}},{"$f":"U1_LS3","v":{"v":1151,"d":"1,151 mm"}}]
[]
[]
[null,null,{"$f":"corner_1_sash!C140","v":"Accessory kits"}]
[]
[null,null,{"$f":"corner_1_sash!C142","v":"Description"},null,{"$f":"corner_1_sash!E142","v":"Article number"},{"$nulls":3},{"$f":"corner_1_sash!I142","v":"Quantity"},{"$f":"corner_1_sash!J142","v":"Unit"}]
[null,null,{"$f":"corner_1_sash!C143","v":"Accessory kit door sash 20 kg"},null,"612 002.0000.000",{"$nulls":3},{"$f":"IF(U1_Flügelgewicht_2<=20,1,0)","v":0},{"$f":"corner_1_sash!J143","v":"piece"}]
[null,null,{"$f":"corner_1_sash!C144","v":"Accessory kit door sash 40 kg"},null,"612 004.0000.000",{"$nulls":3},{"$f":"IF(U1_Flügelgewicht_2>20,1,0)","v":1},{"$f":"corner_1_sash!J144","v":"piece"}]
[null,null,{"$f":"corner_1_sash!C145","v":"Accessory kit installation"},null,"612 010.0000.000",{"$nulls":3},1,{"$f":"corner_1_sash!J145","v":"piece"}]
[null,null,{"$f":"corner_1_sash!C146","v":"Accessory kit corner bracket"},null,"612 020.0000.000",{"$nulls":3},2,{"$f":"corner_1_sash!J146","v":"piece"}]
[]
[null,null,{"$f":"corner_1_sash!C148","v":"Sealing strips (optional, please see above to select or deselect)"}]
[]
[null,null,{"$f":"corner_1_sash!C150","v":"Description"},null,{"$f":"corner_1_sash!E150","v":"Article number"},{"$nulls":3},{"$f":"corner_1_sash!I150","v":"Quantity"},{"$f":"corner_1_sash!J150","v":"Unit"},{"$f":"corner_1_sash!K150","v":"Sales length"},{"$f":"corner_1_sash!L150","v":"Cut length*"}]
[null,null,{"$f":"corner_1_sash!C151","v":"Bulb seal"},null,{"$f":"\"612 410.\"&K165&\".305\"","v":"612 410.2000.305"},{"$nulls":3},{"$f":"IF(U1_Wahl_Dichtl_schließseitig=\"Yes\",1,0)","v":1},{"$f":"corner_1_sash!J151","v":"piece"},{"$f":"VLOOKUP(L165,$E$280:$I$281,2,TRUE)","v":{"v":2000,"d":"2,000 mm"}},{"$f":"U1_HS","v":{"v":1970,"d":"1,970 mm"}}]
[null,null,{"$f":"corner_1_sash!C152","v":"Vertical sealing strips between fixed and sliding sash"},null,{"$f":"\"612 440.\"&K166&\".305\"","v":"612 440.2000.305"},{"$nulls":3},{"$f":"IF(U1_Wahl_Dichtl_F_u_S=\"Yes\",1,0)","v":0},{"$f":"corner_1_sash!J152","v":"pair"},{"$f":"VLOOKUP(L166,$E$280:$I$281,2,TRUE)","v":{"v":2000,"d":"2,000 mm"}},{"$f":"U1_HF-24","v":{"v":1934,"d":"1,934 mm"}}]
[]
[null,null,{"$f":"corner_1_sash!C154","v":"Threshold profile (optional, please see above to select or deselect)"}]
[]
[null,null,{"$f":"corner_1_sash!C156","v":"Description"},null,{"$f":"corner_1_sash!E156","v":"Article number"},{"$nulls":3},{"$f":"corner_1_sash!I156","v":"Quantity"},{"$f":"corner_1_sash!J156","v":"Unit"},{"$f":"corner_1_sash!K156","v":"Sales length"},{"$f":"corner_1_sash!L156","v":"Cut length*"}]
[null,null,{"$f":"corner_1_sash!C157","v":"Threshold profile, cut straight, gloss-polished aluminium"},null,"612 450.1000.111",{"$nulls":3},{"$f":"IF(U1_Wahl_Schwallschutz=\"Yes, made of gloss-polished aluminium\",1,0)","v":0},{"$f":"corner_1_sash!J157","v":"piece"},"1000 mm",{"$f":"U1_LWt+U1_WSZ_final","v":{"v":601,"d":"601 mm"}}]
[null,null,{"$f":"corner_1_sash!C158","v":"Threshold profile, cut straight, transparent plastic"},null,"612 450.1000.305",{"$nulls":3},{"$f":"IF(U1_Wahl_Schwallschutz=\"Yes, made of transparent plastic\",1,0)","v":0},{"$f":"corner_1_sash!J158","v":"piece"},"1000 mm",{"$f":"L171","v":{"v":601,"d":"601 mm"}}]
[]
[null,null,{"$f":"corner_1_sash!C160","v":"Wall profile (optional, please see above to select or deselect)"}]
[]
[null,null,{"$f":"corner_1_sash!C162","v":"Description"},null,{"$f":"corner_1_sash!E162","v":"Article number"},{"$nulls":3},{"$f":"corner_1_sash!I162","v":"Quantity"},{"$f":"corner_1_sash!J162","v":"Unit"},{"$f":"corner_1_sash!K162","v":"Sales length"},{"$f":"corner_1_sash!L162","v":"Cut length*"}]
[null,null,{"$f":"corner_1_sash!C163","v":"Wall profile incl. plastic insert"},null,{"$f":"\"612 520.\"&K177&\".111\"","v":"612 520.2000.111"},{"$nulls":3},{"$f":"IF(U1_Wahl_Wandanschluss=\"Profile\",2,0)","v":0},{"$f":"corner_1_sash!J163","v":"piece"},{"$f":"VLOOKUP(L177,$E$280:$I$281,2,TRUE)","v":{"v":2000,"d":"2,000 mm"}},{"$f":"U1_H-50","v":{"v":1950,"d":"1,950 mm"}}]
[]
[null,null,{"$f":"corner_1_sash!C165","v":"Floor profile (optional, please see above to select or deselect)"}]
[]
[null,null,{"$f":"corner_1_sash!C162","v":"Description"},null,{"$f":"corner_1_sash!E167","v":"Article number"},{"$nulls":3},{"$f":"corner_1_sash!I167","v":"Quantity"},{"$f":"corner_1_sash!J167","v":"Unit"},{"$f":"corner_1_sash!K167","v":"Sales length"}]
[null,null,{"$f":"corner_1_sash!C168","v":"Floor profile length 1000 mm"},null,{"$f":"\"612 530.\"&K182&\".111\"","v":"612 530.1000.111"},{"$nulls":3},{"$f":"IF(U1_Wahl_Bodenprofil=\"Yes\",VLOOKUP(\"Ja\",$K$195:$M$199,2,0),0)","v":0},{"$f":"corner_1_sash!J168","v":"piece"},{"v":1000,"d":"1,000 mm"}]
[null,null,{"$f":"corner_1_sash!C169","v":"Floor profile length 1500 mm"},null,{"$f":"\"612 530.\"&K183&\".111\"","v":"612 530.1500.111"},{"$nulls":3},{"$f":"IF(U1_Wahl_Bodenprofil=\"Yes\",VLOOKUP(\"Ja\",$K$195:$M$199,3,0),0)","v":0},{"$f":"corner_1_sash!J169","v":"piece"},{"v":1500,"d":"1,500 mm"}]
[]
[null,null,{"$f":"corner_1_sash!C171","v":"Description"},null,{"$f":"corner_1_sash!E171","v":"Glass width of fixed sashes"}]
[null,null,{"$f":"corner_1_sash!C172","v":"Approximate required length of floor profile for fixed sash 1"},null,{"$f":"U1_WF1","v":{"v":1186,"d":"1,186 mm"}}]
[null,null,{"$f":"corner_1_sash!C173","v":"Approximate required length of floor profile for fixed sash 2"},null,{"$f":"U1_WF2","v":{"v":591,"d":"591 mm"}}]
[null,null,"Approximate required length of floor profile for fixed sash 3",null,{"$f":"U1_WF3","v":{"v":1197,"d":"1,197 mm"}}]
[null,null,{"$f":"corner_1_sash!C174","v":"Approximate required total length of floor profile"},null,{"$f":"SUM(E186:H188)","v":{"v":2974,"d":"2,974 mm"}}]
[]
[null,null,"Kaufvarianten"]
[]
[{"$nulls":11},"Im Minimum-Fall"]
[null,null,"Zusammenfassung",{"$nulls":5},"Preis Summe","Mögl.?","Minimum und möglich?","Anzahl 1000 mm","Anzahl 1500 mm"]
[null,null,{"$f":"C202","v":"Variante 1: Alle einzeln"},{"$nulls":5},{"$f":"IF(J195=\"Ja\",M205,\"n.a.\")","v":{"v":128.88,"d":"129"}},{"$f":"E213","v":"Ja"},{"$f":"IF(AND(I195=MIN(I195:I199),J195=\"Ja\"),\"Ja\",\"Nein\")","v":"Ja"},{"$f":"IF(K195=\"Ja\",I203,0)","v":1},{"$f":"IF(K195=\"Ja\",I204,0)","v":2}]
[null,null,{"$f":"C215","v":"Variante 2: Festflügel 1 einzeln, Rest zusammen"},{"$nulls":5},{"$f":"IF(J196=\"Ja\",M218,\"n.a.\")","v":"n.a."},{"$f":"E226","v":"Nein"},{"$f":"IF(AND(I196=MIN(I195:I199),J196=\"Ja\"),\"Ja\",\"Nein\")","v":"Nein"},{"$f":"IF(K196=\"Ja\",I216,0)","v":0},{"$f":"IF(K196=\"Ja\",I217,0)","v":0}]
[null,null,{"$f":"C228","v":"Variante 3: Festflügel 2 einzeln, Rest zusammen"},{"$nulls":5},{"$f":"IF(J197=\"Ja\",M231,\"n.a.\")","v":"n.a."},{"$f":"E239","v":"Nein"},{"$f":"IF(AND(I197=MIN(I195:I199),J197=\"Ja\"),\"Ja\",\"Nein\")","v":"Nein"},{"$f":"IF(K197=\"Ja\",I229,0)","v":0},{"$f":"IF(K197=\"Ja\",I230,0)","v":0}]
[null,null,{"$f":"C241","v":"Variante 4: Festflügel 3 einzeln, Rest zusammen"},{"$nulls":5},{"$f":"IF(J198=\"Ja\",M244,\"n.a.\")","v":"n.a."},{"$f":"E252","v":"Nein"},{"$f":"IF(AND(I198=MIN(I195:I199),J198=\"Ja\"),\"Ja\",\"Nein\")","v":"Nein"},{"$f":"IF(K198=\"Ja\",I242,0)","v":0},{"$f":"IF(K198=\"Ja\",I243,0)","v":0}]
[null,null,{"$f":"C254","v":"Variante 5: Alle zusammen"},{"$nulls":5},{"$f":"IF(J199=\"Ja\",M257,\"n.a.\")","v":"n.a."},{"$f":"E265","v":"Nein"},{"$f":"IF(AND(I199=MIN(I195:I199),J199=\"Ja\"),\"Ja\",\"Nein\")","v":"Nein"},{"$f":"IF(K199=\"Ja\",I255,0)","v":0},{"$f":"IF(K199=\"Ja\",I256,0)","v":0}]
[]
[]
[null,null,"Variante 1: Alle einzeln",null,"Artikelnummer",{"$nulls":3},"Anzahl","Einheit","Verkaufslänge","Brutto-VK-Preis","Summe Brutto-VK-Preis"]
[null,null,"Anzahl benötigter Bodenprofile in Länge 1000 mm",null,{"$f":"\"612 XXX.\"&K203&\".111\"","v":"612 XXX.1000.111"},{"$nulls":3},{"$f":"COUNTIF(I208:J210,K203)","v":1},"Stück",{"v":1000,"d":"1,000 mm"},{"$f":"$F$286","v":{"v":32.22,"d":"32.22 €"}},{"$f":"I203*L203","v":{"v":32.22,"d":"32.22 €"}}]
[null,null,"Anzahl benötigter Bodenprofile in Länge 1500 mm",null,{"$f":"\"612 XXX.\"&K204&\".111\"","v":"612 XXX.1500.111"},{"$nulls":3},{"$f":"COUNTIF(I208:J210,K204)","v":2},"Stück",{"v":1500,"d":"1,500 mm"},{"$f":"$F$287","v":{"v":48.33,"d":"48.33 €"}},{"$f":"I204*L204","v":{"v":96.66,"d":"96.66 €"}}]
[{"$nulls":12},{"$f":"M203+M204","v":{"v":128.88,"d":"128.88 €"}}]
[]
[{"$nulls":4},"Länge ben.",{"$nulls":3},"Verkaufslänge"]
[null,null,"Bodenprofil bei Festflügel 1",null,{"$f":"E186","v":{"v":1186,"d":"1,186 mm"}},{"$nulls":3},{"$f":"IF(E208<=1500,VLOOKUP(E208,$E$283:$I$284,2,TRUE),\"nicht vorhanden\")","v":{"v":1500,"d":"1,500 mm"}}]
[null,null,"Bodenprofil bei Festflügel 2",null,{"$f":"E187","v":{"v":591,"d":"591 mm"}},{"$nulls":3},{"$f":"IF(E209<=1500,VLOOKUP(E209,$E$283:$I$284,2,TRUE),\"nicht vorhanden\")","v":{"v":1000,"d":"1,000 mm"}}]
[null,null,"Bodenprofil bei Festflügel 3",null,{"$f":"E188","v":{"v":1197,"d":"1,197 mm"}},{"$nulls":3},{"$f":"IF(E210<=1500,VLOOKUP(E210,$E$283:$I$284,2,TRUE),\"nicht vorhanden\")","v":{"v":1500,"d":"1,500 mm"}}]
[null,null,"Summe",null,{"$f":"SUM(E208:F210)","v":{"v":2974,"d":"2,974 mm"}}]
[]
[null,null,"Ist die Variante eine mögliche Lösung?",null,{"$f":"IF(OR(I208=\"nicht vorhanden\",I209=\"nicht vorhanden\",I210=\"nicht vorhanden\"),\"Nein\",\"Ja\")","v":"Ja"}]
[]
[null,null,"Variante 2: Festflügel 1 einzeln, Rest zusammen",null,"Artikelnummer",{"$nulls":3},"Anzahl","Einheit","Verkaufslänge","Brutto-VK-Preis","Summe Brutto-VK-Preis"]
[null,null,"Anzahl benötigter Bodenprofile in Länge 1000 mm",null,{"$f":"\"612 XXX.\"&K216&\".111\"","v":"612 XXX.1000.111"},{"$nulls":3},{"$f":"COUNTIF(H221:I223,K216)","v":0},"Stück",{"v":1000,"d":"1,000 mm"},{"$f":"$F$286","v":{"v":32.22,"d":"32.22 €"}},{"$f":"I216*L216","v":0}]
[null,null,"Anzahl benötigter Bodenprofile in Länge 1500 mm",null,{"$f":"\"612 XXX.\"&K217&\".111\"","v":"612 XXX.1500.111"},{"$nulls":3},{"$f":"COUNTIF(H221:I223,K217)","v":1},"Stück",{"v":1500,"d":"1,500 mm"},{"$f":"$F$287","v":{"v":48.33,"d":"48.33 €"}},{"$f":"I217*L217","v":{"v":48.33,"d":"48.33 €"}}]
[{"$nulls":12},{"$f":"M216+M217","v":{"v":48.33,"d":"48.33 €"}}]
[]
[{"$nulls":4},"Länge ben.",{"$nulls":3},"Verkaufslänge"]
[null,null,"Ungefähr benötigte Länge an Bodenprofil bei Festflügel 1",null,{"$f":"E186","v":{"v":1186,"d":"1,186 mm"}},{"$nulls":3},{"$f":"IF(E221<=1500,VLOOKUP(E221,$E$283:$I$284,2,TRUE),\"nicht vorhanden\")","v":{"v":1500,"d":"1,500 mm"}}]
[null,null,"Ungefähr in Summe benötigte Länge an Bodenprofil für Festflügel 2 und Festflügel 3 in Summe",null,{"$f":"E187+E188","v":{"v":1788,"d":"1,788 mm"}},{"$nulls":3},{"$f":"IF(E222<=1500,VLOOKUP(E222,$E$283:$I$284,2,TRUE),\"nicht vorhanden\")","v":"nicht vorhanden"}]
[]
[null,null,"Summe",null,{"$f":"SUM(E221:F223)","v":{"v":2974,"d":"2,974 mm"}}]
[]
[null,null,"Ist die Variante eine mögliche Lösung?",null,{"$f":"IF(OR(I221=\"nicht vorhanden\",I222=\"nicht vorhanden\",I223=\"nicht vorhanden\"),\"Nein\",\"Ja\")","v":"Nein"}]
[]
[null,null,"Variante 3: Festflügel 2 einzeln, Rest zusammen",null,"Artikelnummer",{"$nulls":3},"Anzahl","Einheit","Verkaufslänge","Brutto-VK-Preis","Summe Brutto-VK-Preis"]
[null,null,"Anzahl benötigter Bodenprofile in Länge 1000 mm",null,{"$f":"\"612 XXX.\"&K229&\".111\"","v":"612 XXX.1000.111"},{"$nulls":3},{"$f":"COUNTIF(H234:I236,K229)","v":1},"Stück",{"v":1000,"d":"1,000 mm"},{"$f":"$F$286","v":{"v":32.22,"d":"32.22 €"}},{"$f":"I229*L229","v":{"v":32.22,"d":"32.22 €"}}]
[null,null,"Anzahl benötigter Bodenprofile in Länge 1500 mm",null,{"$f":"\"612 XXX.\"&K230&\".111\"","v":"612 XXX.1500.111"},{"$nulls":3},{"$f":"COUNTIF(H234:I236,K230)","v":0},"Stück",{"v":1500,"d":"1,500 mm"},{"$f":"$F$287","v":{"v":48.33,"d":"48.33 €"}},{"$f":"I230*L230","v":0}]
[{"$nulls":12},{"$f":"M229+M230","v":{"v":32.22,"d":"32.22 €"}}]
[]
[{"$nulls":4},"Länge ben.",{"$nulls":3},"Verkaufslänge"]
[null,null,"Ungefähr benötigte Länge an Bodenprofil bei Festflügel 2",null,{"$f":"E187","v":{"v":591,"d":"591 mm"}},{"$nulls":3},{"$f":"IF(E234<=1500,VLOOKUP(E234,$E$283:$I$284,2,TRUE),\"nicht vorhanden\")","v":{"v":1000,"d":"1,000 mm"}}]
[null,null,"Ungefähr in Summe benötigte Länge an Bodenprofil für Festflügel 1 und Festflügel 3 in Summe",null,{"$f":"E186+E188","v":{"v":2383,"d":"2,383 mm"}},{"$nulls":3},{"$f":"IF(E235<=1500,VLOOKUP(E235,$E$283:$I$284,2,TRUE),\"nicht vorhanden\")","v":"nicht vorhanden"}]
[]
[null,null,"Summe",null,{"$f":"SUM(E234:F236)","v":{"v":2974,"d":"2,974 mm"}}]
[]
[null,null,"Ist die Variante eine mögliche Lösung?",null,{"$f":"IF(OR(I234=\"nicht vorhanden\",I235=\"nicht vorhanden\",I236=\"nicht vorhanden\"),\"Nein\",\"Ja\")","v":"Nein"}]
[]
[null,null,"Variante 4: Festflügel 3 einzeln, Rest zusammen",null,"Artikelnummer",{"$nulls":3},"Anzahl","Einheit","Verkaufslänge","Brutto-VK-Preis","Summe Brutto-VK-Preis"]
[null,null,"Anzahl benötigter Bodenprofile in Länge 1000 mm",null,{"$f":"\"612 XXX.\"&K242&\".111\"","v":"612 XXX.1000.111"},{"$nulls":3},{"$f":"COUNTIF(H247:I249,K242)","v":0},"Stück",{"v":1000,"d":"1,000 mm"},{"$f":"$F$286","v":{"v":32.22,"d":"32.22 €"}},{"$f":"I242*L242","v":0}]
[null,null,"Anzahl benötigter Bodenprofile in Länge 1500 mm",null,{"$f":"\"612 XXX.\"&K243&\".111\"","v":"612 XXX.1500.111"},{"$nulls":3},{"$f":"COUNTIF(H247:I249,K243)","v":1},"Stück",{"v":1500,"d":"1,500 mm"},{"$f":"$F$287","v":{"v":48.33,"d":"48.33 €"}},{"$f":"I243*L243","v":{"v":48.33,"d":"48.33 €"}}]
[{"$nulls":12},{"$f":"M242+M243","v":{"v":48.33,"d":"48.33 €"}}]
[]
[{"$nulls":4},"Länge ben.",{"$nulls":3},"Verkaufslänge"]
[null,null,"Ungefähr benötigte Länge an Bodenprofil bei Festflügel 3",null,{"$f":"E188","v":{"v":1197,"d":"1,197 mm"}},{"$nulls":3},{"$f":"IF(E247<=1500,VLOOKUP(E247,$E$283:$I$284,2,TRUE),\"nicht vorhanden\")","v":{"v":1500,"d":"1,500 mm"}}]
[null,null,"Ungefähr in Summe benötigte Länge an Bodenprofil für Festflügel 1 und Festflügel 2 in Summe",null,{"$f":"E186+E187","v":{"v":1777,"d":"1,777 mm"}},{"$nulls":3},{"$f":"IF(E248<=1500,VLOOKUP(E248,$E$283:$I$284,2,TRUE),\"nicht vorhanden\")","v":"nicht vorhanden"}]
[]
[null,null,"Summe",null,{"$f":"SUM(E247:F249)","v":{"v":2974,"d":"2,974 mm"}}]
[]
[null,null,"Ist die Variante eine mögliche Lösung?",null,{"$f":"IF(OR(I247=\"nicht vorhanden\",I248=\"nicht vorhanden\",I249=\"nicht vorhanden\"),\"Nein\",\"Ja\")","v":"Nein"}]
[]
[null,null,"Variante 5: Alle zusammen",null,"Artikelnummer",{"$nulls":3},"Anzahl","Einheit","Verkaufslänge","Brutto-VK-Preis","Summe Brutto-VK-Preis"]
[null,null,"Anzahl benötigter Bodenprofile in Länge 1000 mm",null,{"$f":"\"612 XXX.\"&K255&\".111\"","v":"612 XXX.1000.111"},{"$nulls":3},{"$f":"COUNTIF(H260:I262,K255)","v":0},"Stück",{"v":1000,"d":"1,000 mm"},{"$f":"$F$286","v":{"v":32.22,"d":"32.22 €"}},{"$f":"I255*L255","v":0}]
[null,null,"Anzahl benötigter Bodenprofile in Länge 1500 mm",null,{"$f":"\"612 XXX.\"&K256&\".111\"","v":"612 XXX.1500.111"},{"$nulls":3},{"$f":"COUNTIF(H260:I262,K256)","v":0},"Stück",{"v":1500,"d":"1,500 mm"},{"$f":"$F$287","v":{"v":48.33,"d":"48.33 €"}},{"$f":"I256*L256","v":0}]
[{"$nulls":12},{"$f":"M255+M256","v":0}]
[]
[{"$nulls":4},"Länge ben.",{"$nulls":3},"Verkaufslänge"]
[null,null,"Ungefähr benötigte Länge an Bodenprofil für alle zusammen",null,{"$f":"E189","v":{"v":2974,"d":"2,974 mm"}},{"$nulls":3},{"$f":"IF(E260<=1500,VLOOKUP(E260,$E$283:$I$284,2,TRUE),\"nicht vorhanden\")","v":"nicht vorhanden"}]
[]
[]
[null,null,"Summe",null,{"$f":"SUM(E260:F262)","v":{"v":2974,"d":"2,974 mm"}}]
[]
[null,null,"Ist die Variante eine mögliche Lösung?",null,{"$f":"IF(OR(I260=\"nicht vorhanden\",I261=\"nicht vorhanden\",I262=\"nicht vorhanden\"),\"Nein\",\"Ja\")","v":"Nein"}]
[]
[null,null,{"$f":"corner_1_sash!C210","v":"Finger pull handle (optional, please see above to select or deselect)"}]
[]
[null,null,{"$f":"corner_1_sash!C212","v":"Description"},null,{"$f":"corner_1_sash!E212","v":"Article number"},{"$nulls":3},{"$f":"corner_1_sash!I212","v":"Quantity"},{"$f":"corner_1_sash!J212","v":"Unit"},{"$nulls":3},{"$f":"recess_2_sashes!N175","v":"* With exactly vertical walls and horizontal floors."}]
[null,null,{"$f":"corner_1_sash!C213","v":"Round finger pull handle, diameter 39 mm (diameter of glass drill hole 10 mm), 1 pair for 1 sash (inside and outside), stainless steel"},null,"612 267.0000.020",{"$nulls":3},{"$f":"IF(U1_Wahl_Griff=\"Yes\",1,0)","v":1},"pair"]
[]
[]
[null,null,"Tabelle Profillängen"]
[{"$nulls":3},"Laufschiene/Blende",0,950,null,null,950,null,"mm"]
[{"$nulls":4},950.01,1150,null,null,1150,null,"mm"]
[{"$nulls":4},1150.01,1550,null,null,1550,null,"mm"]
[{"$nulls":4},1550.01,2050,null,null,2050,null,"mm"]
[{"$nulls":4},2050.01,4880,null,null,4880,null,"mm"]
[]
[{"$nulls":3},"Wandprofil/Dichtleisten",0,2000,null,null,2000,null,"mm"]
[{"$nulls":4},2000.01,2490,null,null,2490,null,"mm"]
[]
[{"$nulls":3},"Bodenprofil",0,1000,null,null,1000,null,"mm"]
[{"$nulls":4},1000.01,1500,null,null,1500,null,"mm"]
[]
[{"$nulls":3},"Brutto-VK-Bodenprofil",1000,32.22]
[{"$nulls":4},1500,48.33]
[]
[null,{"$f":"Haftungsausschluss","v":"Willach assumes no liability for damage of any kind that could arise as a result of using this profile and glass dimensions calculator. (11.05.2016 Rev. 3)"}]

{"sheet":"U-shower_1_sash_side","index":7,"n_rows":289,"n_cols":17,"rows_kept":289,"merged":[[0,1,0,14],[3,1,3,17],[4,1,26,17],[28,1,28,5],[28,7,28,17],[29,8,58,11],[29,12,29,17],[30,12,30,17],[31,12,31,17],[32,12,32,17],[33,12,33,17],[34,12,34,17],[35,12,35,17],[36,12,36,17],[37,12,37,17],[38,2,39,3],[38,4,39,4],[38,12,38,17],[39,12,58,17],[41,2,42,3],[41,4,42,4],[44,2,45,3],[44,4,45,4],[47,2,48,3],[50,3,50,4],[53,2,54,3],[53,4,54,4],[56,2,57,3],[56,4,57,4],[61,1,61,16],[63,1,63,17],[65,2,65,5],[65,7,65,16],[67,7,67,10],[69,7,69,10],[71,7,71,10],[73,7,73,10],[75,7,75,10],[77,7,77,10],[79,7,79,10],[81,7,81,10],[91,2,92,16],[95,1,95,5],[95,7,95,17],[97,8,97,16],[99,9,99,10],[103,2,104,4],[103,9,103,10],[107,8,108,8],[107,9,108,10],[107,11,108,11],[107,12,108,12],[107,13,108,13],[107,14,108,14],[107,16,108,16],[112,9,112,10],[113,8,113,16],[115,8,117,16],[124,2,124,4],[136,2,136,4],[141,1,141,16],[143,1,143,17],[145,2,145,3],[147,2,147,3],[147,4,147,7],[147,11,147,12],[147,14,147,16],[148,2,148,3],[148,4,148,7],[148,11,148,12],[149,2,149,3],[149,4,149,7],[149,11,149,12],[150,2,150,3],[150,4,150,7],[150,11,150,12],[151,4,151,7],[151,11,152,12],[153,2,153,3],[155,2,155,3],[155,4,155,7],[155,11,155,12],[155,14,155,16],[156,2,156,3],[156,4,156,7],[157,2,157,3],[157,4,157,7],[158,2,158,3],[158,4,158,7],[159,2,159,3],[159,4,159,7],[161,2,161,12],[163,2,163,3],[163,4,163,7],[163,11,163,12],[163,14,163,16],[164,2,164,3],[164,4,164,7],[164,11,164,12],[165,2,165,3],[165,4,165,7],[165,11,165,12],[167,2,167,12],[169,2,169,3],[169,4,169,7],[169,11,169,12],[169,14,169,16],[170,2,170,3],[170,4,170,7],[170,11,170,12],[171,2,171,3],[171,4,171,7],[171,11,171,12],[173,2,173,12],[175,2,175,3],[175,4,175,7],[175,11,175,12],[175,14,175,16],[176,2,176,3],[176,4,176,7],[176,11,176,12],[178,2,178,12],[180,2,180,3],[180,4,180,7],[181,2,181,3],[181,4,181,7],[182,2,182,3],[182,4,182,7],[184,2,184,3],[184,4,184,7],[184,11,184,12],[185,2,185,3],[185,4,185,7],[185,11,185,12],[186,2,186,3],[186,4,186,7],[187,2,187,3],[187,4,187,7],[187,11,187,12],[188,2,188,3],[188,4,188,7],[190,2,190,3],[192,11,192,12],[193,2,193,3],[193,5,193,7],[194,2,194,3],[195,2,195,3],[196,2,196,3],[197,2,197,3],[198,2,198,3],[200,2,200,3],[201,2,201,3],[201,4,201,7],[202,2,202,3],[202,4,202,7],[203,2,203,3],[203,4,203,7],[206,4,206,5],[206,8,206,9],[207,2,207,3],[207,4,207,5],[207,8,207,9],[208,2,208,3],[208,4,208,5],[208,8,208,9],[209,2,209,3],[209,4,209,5],[209,8,209,9],[210,2,210,3],[210,4,210,5],[211,8,211,9],[212,2,212,3],[212,8,212,9],[213,2,213,3],[214,2,214,3],[214,4,214,7],[215,2,215,3],[215,4,215,7],[216,2,216,3],[216,4,216,7],[219,4,219,5],[219,8,219,9],[220,2,220,3],[220,4,220,5],[220,8,220,9],[221,2,222,3],[221,4,221,5],[221,8,221,9],[222,4,222,5],[222,8,222,9],[223,2,223,3],[223,4,223,5],[225,2,225,3],[227,2,227,3],[227,4,227,7],[228,2,228,3],[228,4,228,7],[229,2,229,3],[229,4,229,7],[232,4,232,5],[232,8,232,9],[233,2,233,3],[233,4,233,5],[233,8,233,9],[234,2,235,3],[234,4,234,5],[234,8,234,9],[235,4,235,5],[235,8,235,9],[236,2,236,3],[236,4,236,5],[238,2,238,3],[240,2,240,3],[240,4,240,7],[241,2,241,3],[241,4,241,7],[242,2,242,3],[242,4,242,7],[245,4,245,5],[245,8,245,9],[246,2,246,3],[246,4,246,5],[246,8,246,9],[247,2,248,3],[247,4,247,5],[247,8,247,9],[248,4,248,5],[248,8,248,9],[249,2,249,3],[249,4,249,5],[251,2,251,3],[253,2,253,3],[253,4,253,7],[254,2,254,3],[254,4,254,7],[255,2,255,3],[255,4,255,7],[258,4,258,5],[258,8,258,9],[259,2,259,3],[259,4,259,5],[259,8,259,9],[260,2,261,3],[260,4,260,5],[260,8,260,9],[261,4,261,5],[261,8,261,9],[262,2,262,3],[262,4,262,5],[264,2,264,3],[266,2,266,3],[268,2,268,3],[268,4,268,7],[268,13,269,16],[269,2,269,3],[269,4,269,7],[272,2,272,16],[288,1,288,16]]}
[null,"Aquant 40: U-shower with 1 sliding sash, door at the side"]
[]
[]
[null,{"$f":"corner_1_sash!B4","v":"Drawings"}]
{"$rows_empty":24}
[null,{"$f":"corner_1_sash!H29","v":"Legend & Formulas"},{"$nulls":5},{"$f":"corner_1_sash!H29","v":"Legend & Formulas"}]
[{"$nulls":8},"Legend\nW1 = System width of side 1\nW2 = System width of side 2\nH = System height\nLS1 = Length of track profile/cover profile 1\nLS2 = Length of track profile/cover profile 2\nLS3 = Length of track profile/cover profile 3\nLWt = Clearance with open door\n\nWS1 = Glass width of sliding sash 1 with handle\nWSZ = Additional width of sliding sash for handle\nHS1 = Glass height of sliding sash 1\n\nWF1 = Glass width of fixed sash 1\nWF2 = Glass width of fixed sash 2\nWF3 = Glass width of fixed sash 3\nWFA = Allowance for fixed sash for wall attachment\nWFZ1 = Additional width of fixed sash 1\nHF1 = Glass height of fixed sash 1\nHF2 = Glass height of fixed sash 2\nHF3 = Glass height of fixed sash 3\n\nUF = Overlap between sliding sash and fixed sash\n\nSMs = Size of gap on the closing side\nSMo1 = Size of gap on the opening side for sliding sash 1",{"$nulls":3},"Formulas"]
[null,null,"W1",{"$f":"corner_1_sash!D31","v":"System width of side 1 (max. 1,500 mm)"},{"v":1200,"d":"1,200"},"(mm)",{"$nulls":6},{"$f":"\"WS1 = (W1 - WFA - WFZ1 + WSZ + UF - SMs - \"&U2_Glasstärke&\") / 2\"","v":"WS1 = (W1 - WFA - WFZ1 + WSZ + UF - SMs - 8) / 2"}]
[{"$nulls":12},"WF2 = W2"]
[null,null,"W2",{"$f":"corner_1_sash!D33","v":"System width of side 2 (max. 1,500 mm)"},{"v":1200,"d":"1,200"},"(mm)",{"$nulls":6},{"$f":"\"WF3 = W1 - WFA - \"&I90","v":"WF3 = W1 - WFA - 11"}]
[{"$nulls":12},{"$f":"\"HS1 = H - \"&U2_HSA_System","v":"HS1 = H - 30"}]
[null,null,"H",{"$f":"corner_1_sash!D35","v":"System height (max. 2,500 mm)"},{"v":2000,"d":"2,000"},"(mm)",{"$nulls":6},{"$f":"\"HF1 = HF2 = HF3 = H - \"&U2_HFA_System","v":"HF1 = HF2 = HF3 = H - 42"}]
[{"$nulls":12},"SMo1 = WFZ1 + WFA"]
[null,null,"WFZ1",{"$f":"corner_1_sash!D37","v":"Additional width of fixed sash 1"},17,"(mm)",{"$nulls":6},{"$f":"\"LS1 = LS3 = W1 - \"&U2_Eckstück","v":"LS1 = LS3 = W1 - 49"}]
[{"$nulls":12},{"$f":"\"LS 2 = W2 - \"&I86","v":"LS 2 = W2 - 98"}]
[null,null,"Do you wish to attach the fixed sash to the wall via a wall profile or directly via silicon?",null,"Silicon",{"$nulls":7},{"$f":"\"LWt = W1 -  WF1 - WSZ - \"&U2_Glasstärke","v":"LWt = W1 -  WF1 - WSZ - 8"}]
[]
[]
[null,null,"Do you wish to use the Aquant floor profile?",null,"No"]
[]
[]
[null,null,"Do you wish to use vertical sealing strips between fixed and sliding sash?",null,"No"]
[]
[]
[null,null,"Do you wish to use an optional threshold profile in the door area (in addition to the obligatory drip rail)?"]
[]
[]
[{"$nulls":3},"No"]
[]
[]
[null,null,"Do you wish to use the Aquant bulb seal?",null,"Yes"]
[]
[]
[null,null,"Do you wish to use the Aquant finger pull handle?",null,"Yes"]
[]
[]
[]
[]
[null,{"$f":"Haftungsausschluss","v":"Willach assumes no liability for damage of any kind that could arise as a result of using this profile and glass dimensions calculator. (11.05.2016 Rev. 3)"}]
[]
[null,{"$f":"corner_1_sash!B63","v":"System dimensions"}]
[]
[null,null,{"$f":"corner_1_sash!C65","v":"System dimensions specified/recommended by Willach"},{"$nulls":4},{"$f":"corner_1_sash!H65","v":"Deviations from system dimensions"}]
[]
[null,null,"HSA",{"$f":"corner_1_sash!D67","v":"Höhenabzugsmaß für Aufnahme Schiebeflügel"},30,"(mm)",null,{"$f":"corner_1_sash!H67","v":"Deviation from system dimension?"},{"$nulls":3},{"$f":"IF(OR(U2_HSA_Wunsch=\"\",U2_HSA_Wunsch=U2_HSA_System),\"Nein\",\"Ja\")","v":"Nein"},{"$f":"corner_1_sash!M67","v":"Desired value"},null,null,{"$f":"IF(OR(L68=\"Nein\",O68=\"\"),E68,O68)","v":30},"(mm)"]
[]
[null,null,"WSZ",{"$f":"corner_1_sash!D69","v":"Additional width of sliding sash for handle"},69,"(mm)",null,{"$f":"corner_1_sash!H69","v":"Deviation from system dimension?"},{"$nulls":3},{"$f":"IF(OR(U2_WSZ_Wunsch=\"\",U2_WSZ_Wunsch=U2_WSZ_System),\"Nein\",\"Ja\")","v":"Nein"},{"$f":"corner_1_sash!M69","v":"Desired value"},null,null,{"$f":"IF(OR(L70=\"Nein\",O70=\"\"),E70,O70)","v":69},"(mm)"]
[]
[null,null,"WFA",{"$f":"corner_1_sash!D71","v":"Allowance for fixed sash for wall attachment"},{"$f":"IF(E39=\"Profile\",14,3)","v":3},"(mm)",null,{"$f":"corner_1_sash!H71","v":"Deviation from system dimension?"},{"$nulls":3},{"$f":"IF(OR(U2_WFA_Wunsch=\"\",U2_WFA_Wunsch=U2_WFA_System),\"Nein\",\"Ja\")","v":"Nein"},{"$f":"corner_1_sash!M71","v":"Desired value"},null,null,{"$f":"IF(OR(L72=\"Nein\",O72=\"\"),E72,O72)","v":3},"(mm)"]
[]
[null,null,"HFA",{"$f":"corner_1_sash!D73","v":"Höhenabzugsmaß für Aufnahme Festflügel"},42,"(mm)",null,{"$f":"corner_1_sash!H73","v":"Deviation from system dimension?"},{"$nulls":3},{"$f":"IF(OR(U2_HFA_Wunsch=\"\",U2_HFA_Wunsch=U2_HFA_System),\"Nein\",\"Ja\")","v":"Nein"},{"$f":"corner_1_sash!M73","v":"Desired value"},null,null,{"$f":"IF(OR(L74=\"Nein\",O74=\"\"),E74,O74)","v":42},"(mm)"]
[]
[null,null,"UF",{"$f":"corner_1_sash!D75","v":"Overlap between sliding sash and fixed sash"},{"$f":"IF(E45=\"Yes\",5,35)","v":35},"(mm)",null,{"$f":"corner_1_sash!H75","v":"Deviation from system dimension?"},{"$nulls":3},{"$f":"IF(OR(U2_UF_Wunsch=\"\",U2_UF_Wunsch=U2_UF_System),\"Nein\",\"Ja\")","v":"Nein"},{"$f":"corner_1_sash!M75","v":"Desired value"},null,null,{"$f":"IF(OR(L76=\"Nein\",O76=\"\"),E76,O76)","v":35},"(mm)"]
[]
[null,null,"SMs",{"$f":"corner_1_sash!D77","v":"Size of gap on the closing side"},14,"(mm)",null,{"$f":"corner_1_sash!H77","v":"Deviation from system dimension?"},{"$nulls":3},{"$f":"IF(OR(U2_SMs_Wunsch=\"\",U2_SMs_Wunsch=U2_SMs_System),\"Nein\",\"Ja\")","v":"Nein"},{"$f":"corner_1_sash!M77","v":"Desired value"},null,null,{"$f":"IF(OR(L78=\"Nein\",O78=\"\"),E78,O78)","v":14},"(mm)"]
[]
[null,null,"SMo",{"$f":"corner_1_sash!D79","v":"Vorgabe Mindest-Spaltmaß öffnungsseitig"},{"$f":"IF($E$39=\"profile\",40,20)","v":20},"(mm)",null,{"$f":"corner_1_sash!H79","v":"Deviation from system dimension?"},{"$nulls":3},{"$f":"IF(OR(U2_SMo_Wunsch=\"\",U2_SMo_Wunsch=U2_SMo_System),\"Nein\",\"Ja\")","v":"Nein"},{"$f":"corner_1_sash!M79","v":"Desired value"},null,null,{"$f":"IF(OR(L80=\"Nein\",O80=\"\"),E80,O80)","v":20},"(mm)"]
[]
[{"$nulls":3},{"$f":"corner_1_sash!D81","v":"Weight of Aquant handle"},0.2,"(kg)",null,{"$f":"corner_1_sash!H81","v":"Deviation from system dimension?"},{"$nulls":3},{"$f":"IF(OR(U2_Gewicht_Griff_Wunsch=\"\",U2_Gewicht_Griff_Wunsch=U2_Gewicht_Griff_System),\"Nein\",\"Ja\")","v":"Nein"},{"$f":"corner_1_sash!M81","v":"Desired value"},null,null,{"$f":"IF(OR(L82=\"Nein\",O82=\"\"),E82,O82)","v":0.2},"(kg)"]
[]
[{"$nulls":3},"Glasstärke",8,"(mm)"]
[]
[{"$nulls":3},"Eckenabzug",49,"(mm)",null,null,{"$f":"U2_Eckstück*2","v":98}]
[]
[{"$nulls":3},"Glasscheibenabstand",15,"(mm)"]
[]
[{"$nulls":3},"Silikon zw. zwei Festflügeln",3,"(mm)",null,null,{"$f":"U2_Glasstärke+E90","v":11}]
[]
[null,null,{"$f":"IF(OR(L68=\"Ja\",L72=\"Ja\",L74=\"Ja\",L76=\"Ja\",L78=\"Ja\",L80=\"Ja\",L70=\"Ja\",L82=\"Ja\"),\"Caution: you are deviating from the suggested system dimension, please check whether the system can be built with the value you have selected!\",\"\")","v":""}]
[]
[]
[]
[null,{"$f":"corner_1_sash!B93","v":"Automatic calculation of glass dimensions and profile lengths*"},{"$nulls":5},{"$f":"corner_1_sash!H93","v":"Automatic check of door sash width, sash weight, aspect ratio and gap dimension on the opening side"}]
[]
[null,null,"Glass dimensions of sliding sash 1",{"$nulls":5},{"$f":"corner_1_sash!I95","v":"Check of the door sash width"}]
[]
[null,null,"WS1","Glass width of sliding sash 1 with handle",{"$f":"(U2_W1-U2_WFA_final-U2_WFZ1+U2_WSZ_final+U2_UF_final-U2_SMs_final-U2_Glasstärke)/2","v":631},"(mm)",null,null,"WS1",{"$f":"D100","v":"Glass width of sliding sash 1 with handle"},null,{"$f":"U2_WS1","v":631},"≥",380,"(mm)",null,{"$f":"IF(L100>=N100,\"Yes\",\"No\")","v":"Yes"}]
[]
[null,null,"HS1","Glass height of sliding sash 1",{"$f":"U2_H-U2_HSA_final","v":{"v":1970,"d":"1,970"}},"(mm)",null,null,{"$f":"corner_1_sash!I99","v":"Check of the sash weight"}]
[]
[null,null,"Please note that drill holes are required, please refer to the relevant drilling drawings!",{"$nulls":6},{"$f":"corner_1_sash!J101","v":"Weight of sliding sash 1"},null,{"$f":"ROUND(U2_WS1/1000*U2_HS/1000*2.5*U2_Glasstärke+U2_Griff_final,0)","v":25},"≤",40,"(kg)",null,{"$f":"IF(L104<=N104,\"Yes\",\"No\")","v":"Yes"}]
[]
[{"$nulls":8},{"$f":"corner_1_sash!I103","v":"Check of the aspect ratio"}]
[null,null,"Glass dimensions of fixed sash 1"]
[{"$nulls":9},{"$f":"corner_1_sash!J105","v":"Height-to-width ratio of sliding sash 1"},null,{"$f":"ROUND(U2_HS/U2_WS1,2)","v":3.12},"≤",5,null,null,{"$f":"IF(L108<=N108,\"Yes\",\"No\")","v":"Yes"}]
[null,null,"WF1","Glass width of fixed sash 1",{"$f":"U2_WS1-U2_WSZ_final+U2_WFZ1","v":579},"(mm)"]
[]
[null,null,"HF1","Glass height of fixed sash 1",{"$f":"U2_H-U2_HFA_final","v":{"v":1958,"d":"1,958"}},"(mm)",null,null,{"$f":"corner_1_sash!I108","v":"Check of the gap dimension on the opening side"}]
[]
[null,null,"Glass dimensions of fixed sash 2",{"$nulls":5},{"$f":"C80&1","v":"SMo1"},{"$f":"corner_1_sash!J110","v":" Gap dimension on the opening side for sliding sash 1"},null,{"$f":"U2_WFZ1+U2_WFA_final","v":20},"≥",{"$f":"P80","v":20},"(mm)",null,{"$f":"IF(L113>=N113,\"Yes\",\"No\")","v":"Yes"}]
[{"$nulls":8},{"$f":"IF(Q113=\"No\",\"Note: if the gap on the opening side is too small , please increase WFZ1.\",\"\")","v":""}]
[null,null,"WF2","Glass width of fixed sash 2",{"$f":"U2_W2","v":{"v":1200,"d":"1,200"}},"(mm)"]
[{"$nulls":8},{"$f":"IF(OR(Q100=\"No\",Q104=\"No\",Q108=\"No\",Q113=\"No\",),\"Caution: the technical restrictions have not been observed; please change your planning!\",\"\")","v":""}]
[null,null,"HF2","Glass height of fixed sash 2",{"$f":"U2_HF","v":{"v":1958,"d":"1,958"}},"(mm)"]
[]
[null,null,"Glass dimensions of fixed sash 3"]
[]
[null,null,"WF3","Glass width of fixed sash 3",{"$f":"U2_W1-U2_WFA_final-(U2_Glasstärke+E90)","v":{"v":1186,"d":"1,186"}},"(mm)"]
[]
[null,null,"HF3","Glass height of fixed sash 3",{"$f":"U2_HF","v":{"v":1958,"d":"1,958"}},"(mm)"]
[]
[null,null,"Length of track profile/cover profile 1"]
[]
[null,null,"LS1",{"$f":"corner_1_sash!D118","v":"Length of track profile/cover profile 1"},{"$f":"U2_W1-U2_Eckstück","v":{"v":1151,"d":"1,151"}},"(mm)"]
[]
[null,null,"Length of track profile/cover profile 2"]
[]
[null,null,"LS2",{"$f":"corner_1_sash!D122","v":"Length of track profile/cover profile 2"},{"$f":"U2_W2-(2*U2_Eckstück)","v":{"v":1102,"d":"1,102"}},"(mm)"]
[]
[null,null,"Length of track profile/cover profile 3"]
[]
[null,null,"LS3",{"$f":"'U-shower_1_sash_front'!D135","v":"Length of track profile/cover profile 3"},{"$f":"U2_LS1","v":{"v":1151,"d":"1,151"}},"(mm)"]
[]
[null,null,{"$f":"corner_1_sash!C124","v":"For information: clearance with open door"}]
[]
[null,null,"LWt",{"$f":"corner_1_sash!D126","v":"Clearance with open door"},{"$f":"U2_W1-U2_WF1-U2_WSZ_final-U2_Glasstärke","v":544},"(mm)"]
[]
[]
[null,{"$f":"Haftungsausschluss","v":"Willach assumes no liability for damage of any kind that could arise as a result of using this profile and glass dimensions calculator. (11.05.2016 Rev. 3)"}]
[]
[null,{"$f":"corner_1_sash!B131","v":"Order list"}]
[]
[null,null,{"$f":"corner_1_sash!C133","v":"Profile sets"}]
[]
[null,null,{"$f":"corner_1_sash!C135","v":"Description"},null,{"$f":"corner_1_sash!E135","v":"Article number"},{"$nulls":3},{"$f":"corner_1_sash!I135","v":"Quantity"},{"$f":"corner_1_sash!J135","v":"Unit"},{"$f":"corner_1_sash!K135","v":"Sales length"},{"$f":"corner_1_sash!L135","v":"Cut length*"}]
[null,null,{"$f":"'U-shower_1_sash_front'!C149:D149","v":"Profile set for side 1"},null,{"$f":"IF(K149<1000,\"612 070.0\"&K149&\".111\",\"612 070.\"&K149&\".111\")","v":"612 070.1550.111"},{"$nulls":3},1,{"$f":"corner_1_sash!J136","v":"piece"},{"$f":"VLOOKUP(L149,$E$274:$I$278,2,TRUE)","v":{"v":1550,"d":"1,550 mm"}},{"$f":"U2_LS1","v":{"v":1151,"d":"1,151 mm"}}]
[null,null,{"$f":"'U-shower_1_sash_front'!C150:D150","v":"Profile set for side 2"},null,{"$f":"IF(K150<1000,\"612 070.0\"&K150&\".111\",\"612 070.\"&K150&\".111\")","v":"612 070.1150.111"},{"$nulls":3},1,{"$f":"J149","v":"piece"},{"$f":"VLOOKUP(L150,$E$274:$I$278,2,TRUE)","v":{"v":1150,"d":"1,150 mm"}},{"$f":"U2_LS2","v":{"v":1102,"d":"1,102 mm"}}]
[null,null,{"$f":"'U-shower_1_sash_front'!C151:D151","v":"Profile set for side 3"},null,{"$f":"IF(K151<1000,\"612 070.0\"&K151&\".111\",\"612 070.\"&K151&\".111\")","v":"612 070.1550.111"},{"$nulls":3},1,{"$f":"J149","v":"piece"},{"$f":"VLOOKUP(L151,$E$274:$I$278,2,TRUE)","v":{"v":1550,"d":"1,550 mm"}},{"$f":"U2_LS3","v":{"v":1151,"d":"1,151 mm"}}]
[]
[]
[null,null,{"$f":"corner_1_sash!C140","v":"Accessory kits"}]
[]
[null,null,{"$f":"corner_1_sash!C142","v":"Description"},null,{"$f":"corner_1_sash!E142","v":"Article number"},{"$nulls":3},{"$f":"corner_1_sash!I142","v":"Quantity"},{"$f":"corner_1_sash!J142","v":"Unit"}]
[null,null,{"$f":"corner_1_sash!C143","v":"Accessory kit door sash 20 kg"},null,"612 002.0000.000",{"$nulls":3},{"$f":"IF(U2_Flügelgewicht_1<=20,1,0)","v":0},{"$f":"corner_1_sash!J143","v":"piece"}]
[null,null,{"$f":"corner_1_sash!C144","v":"Accessory kit door sash 40 kg"},null,"612 004.0000.000",{"$nulls":3},{"$f":"IF(U2_Flügelgewicht_1>20,1,0)","v":1},{"$f":"corner_1_sash!J144","v":"piece"}]
[null,null,{"$f":"corner_1_sash!C145","v":"Accessory kit installation"},null,"612 010.0000.000",{"$nulls":3},1,{"$f":"corner_1_sash!J145","v":"piece"}]
[null,null,{"$f":"corner_1_sash!C146","v":"Accessory kit corner bracket"},null,"612 020.0000.000",{"$nulls":3},2,{"$f":"corner_1_sash!J146","v":"piece"}]
[]
[null,null,{"$f":"corner_1_sash!C148","v":"Sealing strips (optional, please see above to select or deselect)"}]
[]
[null,null,{"$f":"corner_1_sash!C150","v":"Description"},null,{"$f":"corner_1_sash!E150","v":"Article number"},{"$nulls":3},{"$f":"corner_1_sash!I150","v":"Quantity"},{"$f":"corner_1_sash!J150","v":"Unit"},{"$f":"corner_1_sash!K150","v":"Sales length"},{"$f":"corner_1_sash!L150","v":"Cut length*"}]
[null,null,{"$f":"corner_1_sash!C151","v":"Bulb seal"},null,{"$f":"\"612 410.\"&K165&\".305\"","v":"612 410.2000.305"},{"$nulls":3},{"$f":"IF(U2_Wahl_Dichtl_schließseitig=\"Yes\",1,0)","v":1},{"$f":"corner_1_sash!J151","v":"piece"},{"$f":"VLOOKUP(L165,$E$280:$I$281,2,TRUE)","v":{"v":2000,"d":"2,000 mm"}},{"$f":"U2_HS","v":{"v":1970,"d":"1,970 mm"}}]
[null,null,{"$f":"corner_1_sash!C152","v":"Vertical sealing strips between fixed and sliding sash"},null,{"$f":"\"612 440.\"&K166&\".305\"","v":"612 440.2000.305"},{"$nulls":3},{"$f":"IF(U2_Wahl_Dichtl_F_u_S=\"Yes\",1,0)","v":0},{"$f":"corner_1_sash!J152","v":"pair"},{"$f":"VLOOKUP(L166,$E$280:$I$281,2,TRUE)","v":{"v":2000,"d":"2,000 mm"}},{"$f":"U2_HF-24","v":{"v":1934,"d":"1,934 mm"}}]
[]
[null,null,{"$f":"corner_1_sash!C154","v":"Threshold profile (optional, please see above to select or deselect)"}]
[]
[null,null,{"$f":"corner_1_sash!C156","v":"Description"},null,{"$f":"corner_1_sash!E156","v":"Article number"},{"$nulls":3},{"$f":"corner_1_sash!I156","v":"Quantity"},{"$f":"corner_1_sash!J156","v":"Unit"},{"$f":"corner_1_sash!K156","v":"Sales length"},{"$f":"corner_1_sash!L156","v":"Cut length*"}]
[null,null,{"$f":"corner_1_sash!C157","v":"Threshold profile, cut straight, gloss-polished aluminium"},null,"612 450.1000.111",{"$nulls":3},{"$f":"IF(U2_Wahl_Schwallschutz=\"Yes, made of gloss-polished aluminium\",1,0)","v":0},{"$f":"corner_1_sash!J157","v":"piece"},"1000 mm",{"$f":"U2_LWt+U2_WSZ_final","v":{"v":613,"d":"613 mm"}}]
[null,null,{"$f":"corner_1_sash!C158","v":"Threshold profile, cut straight, transparent plastic"},null,"612 450.1000.305",{"$nulls":3},{"$f":"IF(U2_Wahl_Schwallschutz=\"Yes, made of transparent plastic\",1,0)","v":0},{"$f":"corner_1_sash!J158","v":"piece"},"1000 mm",{"$f":"L171","v":{"v":613,"d":"613 mm"}}]
[]
[null,null,{"$f":"corner_1_sash!C160","v":"Wall profile (optional, please see above to select or deselect)"}]
[]
[null,null,{"$f":"corner_1_sash!C162","v":"Description"},null,{"$f":"corner_1_sash!E162","v":"Article number"},{"$nulls":3},{"$f":"corner_1_sash!I162","v":"Quantity"},{"$f":"corner_1_sash!J162","v":"Unit"},{"$f":"corner_1_sash!K162","v":"Sales length"},{"$f":"corner_1_sash!L162","v":"Cut length*"}]
[null,null,{"$f":"corner_1_sash!C163","v":"Wall profile incl. plastic insert"},null,{"$f":"\"612 520.\"&K177&\".111\"","v":"612 520.2000.111"},{"$nulls":3},{"$f":"IF(U2_Wahl_Wandanschluss=\"Profile\",2,0)","v":0},{"$f":"corner_1_sash!J163","v":"piece"},{"$f":"VLOOKUP(L177,$E$280:$I$281,2,TRUE)","v":{"v":2000,"d":"2,000 mm"}},{"$f":"U2_H-50","v":{"v":1950,"d":"1,950 mm"}}]
[]
[null,null,{"$f":"corner_1_sash!C165","v":"Floor profile (optional, please see above to select or deselect)"}]
[]
[null,null,{"$f":"corner_1_sash!C167","v":"Description"},null,{"$f":"corner_1_sash!E167","v":"Article number"},{"$nulls":3},{"$f":"corner_1_sash!I167","v":"Quantity"},{"$f":"corner_1_sash!J167","v":"Unit"},{"$f":"corner_1_sash!K167","v":"Sales length"}]
[null,null,{"$f":"corner_1_sash!C168","v":"Floor profile length 1000 mm"},null,{"$f":"\"612 530.\"&K182&\".111\"","v":"612 530.1000.111"},{"$nulls":3},{"$f":"IF(U2_Wahl_Bodenprofil=\"Yes\",VLOOKUP(\"Ja\",$K$195:$M$199,2,0),0)","v":0},{"$f":"corner_1_sash!J168","v":"piece"},{"v":1000,"d":"1,000 mm"}]
[null,null,{"$f":"corner_1_sash!C169","v":"Floor profile length 1500 mm"},null,{"$f":"\"612 530.\"&K183&\".111\"","v":"612 530.1500.111"},{"$nulls":3},{"$f":"IF(U2_Wahl_Bodenprofil=\"Yes\",VLOOKUP(\"Ja\",$K$195:$M$199,3,0),0)","v":0},{"$f":"corner_1_sash!J169","v":"piece"},{"v":1500,"d":"1,500 mm"}]
[]
[null,null,{"$f":"corner_1_sash!C167","v":"Description"},null,{"$f":"corner_1_sash!E171","v":"Glass width of fixed sashes"}]
[null,null,{"$f":"'U-shower_1_sash_front'!C186:D186","v":"Approximate required length of floor profile for fixed sash 1"},null,{"$f":"U2_WF1","v":{"v":579,"d":"579 mm"}}]
[null,null,{"$f":"'U-shower_1_sash_front'!C187:D187","v":"Approximate required length of floor profile for fixed sash 2"},null,{"$f":"U2_WF2","v":{"v":1200,"d":"1,200 mm"}}]
[null,null,{"$f":"'U-shower_1_sash_front'!C188:D188","v":"Approximate required length of floor profile for fixed sash 3"},null,{"$f":"U2_WF3","v":{"v":1186,"d":"1,186 mm"}}]
[null,null,{"$f":"'U-shower_1_sash_front'!C189:D189","v":"Approximate required total length of floor profile"},null,{"$f":"SUM(E186:H188)","v":{"v":2965,"d":"2,965 mm"}}]
[]
[null,null,"Kaufvarianten"]
[]
[{"$nulls":11},"Im Minimum-Fall"]
[null,null,"Zusammenfassung",{"$nulls":5},"Preis Summe","Mögl.?","Minimum und möglich?","Anzahl 1000 mm","Anzahl 1500 mm"]
[null,null,{"$f":"C202","v":"Variante 1: Alle einzeln"},{"$nulls":5},{"$f":"IF(J195=\"Ja\",M205,\"n.a.\")","v":{"v":128.88,"d":"129"}},{"$f":"E213","v":"Ja"},{"$f":"IF(AND(I195=MIN(I195:I199),J195=\"Ja\"),\"Ja\",\"Nein\")","v":"Ja"},{"$f":"IF(K195=\"Ja\",I203,0)","v":1},{"$f":"IF(K195=\"Ja\",I204,0)","v":2}]
[null,null,{"$f":"C215","v":"Variante 2: Festflügel 1 einzeln, Rest zusammen"},{"$nulls":5},{"$f":"IF(J196=\"Ja\",M218,\"n.a.\")","v":"n.a."},{"$f":"E226","v":"Nein"},{"$f":"IF(AND(I196=MIN(I195:I199),J196=\"Ja\"),\"Ja\",\"Nein\")","v":"Nein"},{"$f":"IF(K196=\"Ja\",I216,0)","v":0},{"$f":"IF(K196=\"Ja\",I217,0)","v":0}]
[null,null,{"$f":"C228","v":"Variante 3: Festflügel 2 einzeln, Rest zusammen"},{"$nulls":5},{"$f":"IF(J197=\"Ja\",M231,\"n.a.\")","v":"n.a."},{"$f":"E239","v":"Nein"},{"$f":"IF(AND(I197=MIN(I195:I199),J197=\"Ja\"),\"Ja\",\"Nein\")","v":"Nein"},{"$f":"IF(K197=\"Ja\",I229,0)","v":0},{"$f":"IF(K197=\"Ja\",I230,0)","v":0}]
[null,null,{"$f":"C241","v":"Variante 4: Festflügel 3 einzeln, Rest zusammen"},{"$nulls":5},{"$f":"IF(J198=\"Ja\",M244,\"n.a.\")","v":"n.a."},{"$f":"E252","v":"Nein"},{"$f":"IF(AND(I198=MIN(I195:I199),J198=\"Ja\"),\"Ja\",\"Nein\")","v":"Nein"},{"$f":"IF(K198=\"Ja\",I242,0)","v":0},{"$f":"IF(K198=\"Ja\",I243,0)","v":0}]
[null,null,{"$f":"C254","v":"Variante 5: Alle zusammen"},{"$nulls":5},{"$f":"IF(J199=\"Ja\",M257,\"n.a.\")","v":"n.a."},{"$f":"E265","v":"Nein"},{"$f":"IF(AND(I199=MIN(I195:I199),J199=\"Ja\"),\"Ja\",\"Nein\")","v":"Nein"},{"$f":"IF(K199=\"Ja\",I255,0)","v":0},{"$f":"IF(K199=\"Ja\",I256,0)","v":0}]
[]
[]
[null,null,"Variante 1: Alle einzeln",null,"Artikelnummer",{"$nulls":3},"Anzahl","Einheit","Verkaufslänge","Brutto-VK-Preis","Summe Brutto-VK-Preis"]
[null,null,"Anzahl benötigter Bodenprofile in Länge 1000 mm",null,{"$f":"\"612 XXX.\"&K203&\".111\"","v":"612 XXX.1000.111"},{"$nulls":3},{"$f":"COUNTIF(I208:J210,K203)","v":1},"Stück",{"v":1000,"d":"1,000 mm"},{"$f":"$F$286","v":{"v":32.22,"d":"32.22 €"}},{"$f":"I203*L203","v":{"v":32.22,"d":"32.22 €"}}]
[null,null,"Anzahl benötigter Bodenprofile in Länge 1500 mm",null,{"$f":"\"612 XXX.\"&K204&\".111\"","v":"612 XXX.1500.111"},{"$nulls":3},{"$f":"COUNTIF(I208:J210,K204)","v":2},"Stück",{"v":1500,"d":"1,500 mm"},{"$f":"$F$287","v":{"v":48.33,"d":"48.33 €"}},{"$f":"I204*L204","v":{"v":96.66,"d":"96.66 €"}}]
[{"$nulls":12},{"$f":"M203+M204","v":{"v":128.88,"d":"128.88 €"}}]
[]
[{"$nulls":4},"Länge ben.",{"$nulls":3},"Verkaufslänge"]
[null,null,"Bodenprofil bei Festflügel 1",null,{"$f":"E186","v":{"v":579,"d":"579 mm"}},{"$nulls":3},{"$f":"IF(E208<=1500,VLOOKUP(E208,$E$283:$I$284,2,TRUE),\"nicht vorhanden\")","v":{"v":1000,"d":"1,000 mm"}}]
[null,null,"Bodenprofil bei Festflügel 2",null,{"$f":"E187","v":{"v":1200,"d":"1,200 mm"}},{"$nulls":3},{"$f":"IF(E209<=1500,VLOOKUP(E209,$E$283:$I$284,2,TRUE),\"nicht vorhanden\")","v":{"v":1500,"d":"1,500 mm"}}]
[null,null,"Bodenprofil bei Festflügel 3",null,{"$f":"E188","v":{"v":1186,"d":"1,186 mm"}},{"$nulls":3},{"v":1500,"d":"1,500 mm"}]
[null,null,"Summe",null,{"$f":"SUM(E208:F210)","v":{"v":2965,"d":"2,965 mm"}}]
[]
[null,null,"Ist die Variante eine mögliche Lösung?",null,{"$f":"IF(OR(I208=\"nicht vorhanden\",I209=\"nicht vorhanden\",I210=\"nicht vorhanden\"),\"Nein\",\"Ja\")","v":"Ja"}]
[]
[null,null,"Variante 2: Festflügel 1 einzeln, Rest zusammen",null,"Artikelnummer",{"$nulls":3},"Anzahl","Einheit","Verkaufslänge","Brutto-VK-Preis","Summe Brutto-VK-Preis"]
[null,null,"Anzahl benötigter Bodenprofile in Länge 1000 mm",null,{"$f":"\"612 XXX.\"&K216&\".111\"","v":"612 XXX.1000.111"},{"$nulls":3},{"$f":"COUNTIF(H221:I223,K216)","v":1},"Stück",{"v":1000,"d":"1,000 mm"},{"$f":"$F$286","v":{"v":32.22,"d":"32.22 €"}},{"$f":"I216*L216","v":{"v":32.22,"d":"32.22 €"}}]
[null,null,"Anzahl benötigter Bodenprofile in Länge 1500 mm",null,{"$f":"\"612 XXX.\"&K217&\".111\"","v":"612 XXX.1500.111"},{"$nulls":3},{"$f":"COUNTIF(H221:I223,K217)","v":0},"Stück",{"v":1500,"d":"1,500 mm"},{"$f":"$F$287","v":{"v":48.33,"d":"48.33 €"}},{"$f":"I217*L217","v":0}]
[{"$nulls":12},{"$f":"M216+M217","v":{"v":32.22,"d":"32.22 €"}}]
[]
[{"$nulls":4},"Länge ben.",{"$nulls":3},"Verkaufslänge"]
[null,null,"Ungefähr benötigte Länge an Bodenprofil bei Festflügel 1",null,{"$f":"E186","v":{"v":579,"d":"579 mm"}},{"$nulls":3},{"$f":"IF(E221<=1500,VLOOKUP(E221,$E$283:$I$284,2,TRUE),\"nicht vorhanden\")","v":{"v":1000,"d":"1,000 mm"}}]
[null,null,"Ungefähr in Summe benötigte Länge an Bodenprofil für Festflügel 2 und Festflügel 3 in Summe",null,{"$f":"E187+E188","v":{"v":2386,"d":"2,386 mm"}},{"$nulls":3},{"$f":"IF(E222<=1500,VLOOKUP(E222,$E$283:$I$284,2,TRUE),\"nicht vorhanden\")","v":"nicht vorhanden"}]
[]
[null,null,"Summe",null,{"$f":"SUM(E221:F223)","v":{"v":2965,"d":"2,965 mm"}}]
[]
[null,null,"Ist die Variante eine mögliche Lösung?",null,{"$f":"IF(OR(I221=\"nicht vorhanden\",I222=\"nicht vorhanden\",I223=\"nicht vorhanden\"),\"Nein\",\"Ja\")","v":"Nein"}]
[]
[null,null,"Variante 3: Festflügel 2 einzeln, Rest zusammen",null,"Artikelnummer",{"$nulls":3},"Anzahl","Einheit","Verkaufslänge","Brutto-VK-Preis","Summe Brutto-VK-Preis"]
[null,null,"Anzahl benötigter Bodenprofile in Länge 1000 mm",null,{"$f":"\"612 XXX.\"&K229&\".111\"","v":"612 XXX.1000.111"},{"$nulls":3},{"$f":"COUNTIF(H234:I236,K229)","v":0},"Stück",{"v":1000,"d":"1,000 mm"},{"$f":"$F$286","v":{"v":32.22,"d":"32.22 €"}},{"$f":"I229*L229","v":0}]
[null,null,"Anzahl benötigter Bodenprofile in Länge 1500 mm",null,{"$f":"\"612 XXX.\"&K230&\".111\"","v":"612 XXX.1500.111"},{"$nulls":3},{"$f":"COUNTIF(H234:I236,K230)","v":1},"Stück",{"v":1500,"d":"1,500 mm"},{"$f":"$F$287","v":{"v":48.33,"d":"48.33 €"}},{"$f":"I230*L230","v":{"v":48.33,"d":"48.33 €"}}]
[{"$nulls":12},{"$f":"M229+M230","v":{"v":48.33,"d":"48.33 €"}}]
[]
[{"$nulls":4},"Länge ben.",{"$nulls":3},"Verkaufslänge"]
[null,null,"Ungefähr benötigte Länge an Bodenprofil bei Festflügel 2",null,{"$f":"E187","v":{"v":1200,"d":"1,200 mm"}},{"$nulls":3},{"$f":"IF(E234<=1500,VLOOKUP(E234,$E$283:$I$284,2,TRUE),\"nicht vorhanden\")","v":{"v":1500,"d":"1,500 mm"}}]
[null,null,"Ungefähr in Summe benötigte Länge an Bodenprofil für Festflügel 1 und Festflügel 3 in Summe",null,{"$f":"E186+E188","v":{"v":1765,"d":"1,765 mm"}},{"$nulls":3},{"$f":"IF(E235<=1500,VLOOKUP(E235,$E$283:$I$284,2,TRUE),\"nicht vorhanden\")","v":"nicht vorhanden"}]
[]
[null,null,"Summe",null,{"$f":"SUM(E234:F236)","v":{"v":2965,"d":"2,965 mm"}}]
[]
[null,null,"Ist die Variante eine mögliche Lösung?",null,{"$f":"IF(OR(I234=\"nicht vorhanden\",I235=\"nicht vorhanden\",I236=\"nicht vorhanden\"),\"Nein\",\"Ja\")","v":"Nein"}]
[]
[null,null,"Variante 4: Festflügel 3 einzeln, Rest zusammen",null,"Artikelnummer",{"$nulls":3},"Anzahl","Einheit","Verkaufslänge","Brutto-VK-Preis","Summe Brutto-VK-Preis"]
[null,null,"Anzahl benötigter Bodenprofile in Länge 1000 mm",null,{"$f":"\"612 XXX.\"&K242&\".111\"","v":"612 XXX.1000.111"},{"$nulls":3},{"$f":"COUNTIF(H247:I249,K242)","v":0},"Stück",{"v":1000,"d":"1,000 mm"},{"$f":"$F$286","v":{"v":32.22,"d":"32.22 €"}},{"$f":"I242*L242","v":0}]
[null,null,"Anzahl benötigter Bodenprofile in Länge 1500 mm",null,{"$f":"\"612 XXX.\"&K243&\".111\"","v":"612 XXX.1500.111"},{"$nulls":3},{"$f":"COUNTIF(H247:I249,K243)","v":1},"Stück",{"v":1500,"d":"1,500 mm"},{"$f":"$F$287","v":{"v":48.33,"d":"48.33 €"}},{"$f":"I243*L243","v":{"v":48.33,"d":"48.33 €"}}]
[{"$nulls":12},{"$f":"M242+M243","v":{"v":48.33,"d":"48.33 €"}}]
[]
[{"$nulls":4},"Länge ben.",{"$nulls":3},"Verkaufslänge"]
[null,null,"Ungefähr benötigte Länge an Bodenprofil bei Festflügel 3",null,{"$f":"E188","v":{"v":1186,"d":"1,186 mm"}},{"$nulls":3},{"$f":"IF(E247<=1500,VLOOKUP(E247,$E$283:$I$284,2,TRUE),\"nicht vorhanden\")","v":{"v":1500,"d":"1,500 mm"}}]
[null,null,"Ungefähr in Summe benötigte Länge an Bodenprofil für Festflügel 1 und Festflügel 2 in Summe",null,{"$f":"E186+E187","v":{"v":1779,"d":"1,779 mm"}},{"$nulls":3},{"$f":"IF(E248<=1500,VLOOKUP(E248,$E$283:$I$284,2,TRUE),\"nicht vorhanden\")","v":"nicht vorhanden"}]
[]
[null,null,"Summe",null,{"$f":"SUM(E247:F249)","v":{"v":2965,"d":"2,965 mm"}}]
[]
[null,null,"Ist die Variante eine mögliche Lösung?",null,{"$f":"IF(OR(I247=\"nicht vorhanden\",I248=\"nicht vorhanden\",I249=\"nicht vorhanden\"),\"Nein\",\"Ja\")","v":"Nein"}]
[]
[null,null,"Variante 5: Alle zusammen",null,"Artikelnummer",{"$nulls":3},"Anzahl","Einheit","Verkaufslänge","Brutto-VK-Preis","Summe Brutto-VK-Preis"]
[null,null,"Anzahl benötigter Bodenprofile in Länge 1000 mm",null,{"$f":"\"612 XXX.\"&K255&\".111\"","v":"612 XXX.1000.111"},{"$nulls":3},{"$f":"COUNTIF(H260:I262,K255)","v":0},"Stück",{"v":1000,"d":"1,000 mm"},{"$f":"$F$286","v":{"v":32.22,"d":"32.22 €"}},{"$f":"I255*L255","v":0}]
[null,null,"Anzahl benötigter Bodenprofile in Länge 1500 mm",null,{"$f":"\"612 XXX.\"&K256&\".111\"","v":"612 XXX.1500.111"},{"$nulls":3},{"$f":"COUNTIF(H260:I262,K256)","v":0},"Stück",{"v":1500,"d":"1,500 mm"},{"$f":"$F$287","v":{"v":48.33,"d":"48.33 €"}},{"$f":"I256*L256","v":0}]
[{"$nulls":12},{"$f":"M255+M256","v":0}]
[]
[{"$nulls":4},"Länge ben.",{"$nulls":3},"Verkaufslänge"]
[null,null,"Ungefähr benötigte Länge an Bodenprofil für alle zusammen",null,{"$f":"E189","v":{"v":2965,"d":"2,965 mm"}},{"$nulls":3},{"$f":"IF(E260<=1500,VLOOKUP(E260,$E$283:$I$284,2,TRUE),\"nicht vorhanden\")","v":"nicht vorhanden"}]
[]
[]
[null,null,"Summe",null,{"$f":"SUM(E260:F262)","v":{"v":2965,"d":"2,965 mm"}}]
[]
[null,null,"Ist die Variante eine mögliche Lösung?",null,{"$f":"IF(OR(I260=\"nicht vorhanden\",I261=\"nicht vorhanden\",I262=\"nicht vorhanden\"),\"Nein\",\"Ja\")","v":"Nein"}]
[]
[null,null,{"$f":"corner_1_sash!C210","v":"Finger pull handle (optional, please see above to select or deselect)"}]
[]
[null,null,{"$f":"corner_1_sash!C212","v":"Description"},null,{"$f":"corner_1_sash!E212","v":"Article number"},{"$nulls":3},{"$f":"corner_1_sash!I212","v":"Quantity"},{"$f":"corner_1_sash!J212","v":"Unit"},{"$nulls":3},{"$f":"corner_1_sash!N212","v":"* With exactly vertical walls and horizontal floors."}]
[null,null,{"$f":"corner_1_sash!C213","v":"Round finger pull handle, diameter 39 mm (diameter of glass drill hole 10 mm), 1 pair for 1 sash (inside and outside), stainless steel"},null,"612 267.0000.020",{"$nulls":3},{"$f":"IF(U2_Wahl_Griff=\"Yes\",1,0)","v":1},{"$f":"corner_1_sash!J213","v":"pair"}]
[]
[]
[null,null,"Tabelle Profillängen"]
[{"$nulls":3},"Laufschiene/Blende",0,950,null,null,950,null,"mm"]
[{"$nulls":4},950.01,1150,null,null,1150,null,"mm"]
[{"$nulls":4},1150.01,1550,null,null,1550,null,"mm"]
[{"$nulls":4},1550.01,2050,null,null,2050,null,"mm"]
[{"$nulls":4},2050.01,4880,null,null,4880,null,"mm"]
[]
[{"$nulls":3},"Wandprofil/Dichtleisten",0,2000,null,null,2000,null,"mm"]
[{"$nulls":4},2000.01,2490,null,null,2490,null,"mm"]
[]
[{"$nulls":3},"Bodenprofil",0,1000,null,null,1000,null,"mm"]
[{"$nulls":4},1000.01,1500,null,null,1500,null,"mm"]
[]
[{"$nulls":3},"Brutto-VK-Bodenprofil",1000,32.22]
[{"$nulls":4},1500,48.33]
[]
[null,{"$f":"Haftungsausschluss","v":"Willach assumes no liability for damage of any kind that could arise as a result of using this profile and glass dimensions calculator. (11.05.2016 Rev. 3)"}]

{"sheet":"U-shower_2_sashes_corner entry","index":8,"n_rows":301,"n_cols":17,"rows_kept":301,"merged":[[0,1,0,14],[3,1,3,17],[4,1,26,17],[28,1,28,5],[28,7,28,17],[29,8,60,11],[29,12,29,17],[30,12,30,17],[31,12,31,17],[32,12,32,17],[33,12,33,17],[34,12,34,17],[35,12,35,17],[36,12,36,17],[37,12,37,17],[38,12,38,17],[39,12,39,17],[40,2,41,3],[40,4,41,4],[40,12,40,17],[41,12,60,17],[43,2,44,3],[43,4,44,4],[46,2,47,3],[46,4,47,4],[49,2,50,3],[52,3,52,4],[55,2,56,3],[55,4,56,4],[58,2,59,3],[58,4,59,4],[62,1,62,16],[64,1,64,17],[66,2,66,5],[66,7,66,16],[68,7,68,10],[70,7,70,10],[72,7,72,10],[74,7,74,10],[76,7,76,10],[78,7,78,10],[80,7,80,10],[82,7,82,10],[84,7,84,10],[94,2,95,16],[98,1,98,5],[98,7,98,17],[100,8,100,16],[102,9,102,10],[104,9,104,10],[106,2,107,4],[106,8,106,16],[108,9,108,10],[109,2,109,4],[110,9,110,10],[114,8,115,8],[114,9,115,10],[114,11,115,11],[114,12,115,12],[114,13,115,13],[114,16,115,16],[115,2,116,4],[117,8,118,8],[117,9,118,10],[117,11,118,11],[117,12,118,12],[117,13,118,13],[117,16,118,16],[118,2,118,4],[122,9,122,10],[123,9,123,10],[124,2,124,4],[124,8,125,16],[127,8,129,16],[130,2,130,4],[136,2,136,4],[148,2,148,4],[153,1,153,16],[155,1,155,17],[157,2,157,3],[159,2,159,3],[159,4,159,7],[159,11,159,12],[159,14,159,16],[160,2,160,3],[160,4,160,7],[160,11,160,12],[161,2,161,3],[161,4,161,7],[161,11,161,12],[162,2,162,3],[162,4,162,7],[162,11,162,12],[163,4,163,7],[164,2,164,3],[166,2,166,3],[166,4,166,7],[166,11,166,12],[166,14,166,16],[167,2,167,3],[167,4,167,7],[168,2,168,3],[168,4,168,7],[169,2,169,3],[169,4,169,7],[170,2,170,3],[170,4,170,7],[172,2,172,12],[174,2,174,3],[174,4,174,7],[174,11,174,12],[174,14,174,16],[175,2,175,3],[175,4,175,7],[175,11,175,12],[175,13,176,13],[176,2,176,3],[176,4,176,7],[176,11,176,12],[178,2,178,12],[180,2,180,3],[180,4,180,7],[180,11,180,12],[180,14,180,16],[181,2,181,3],[181,4,181,7],[182,2,182,3],[182,4,182,7],[184,2,184,12],[186,2,186,3],[186,4,186,7],[186,11,186,12],[186,14,186,16],[187,2,187,3],[187,4,187,7],[187,11,187,12],[189,2,189,12],[191,2,191,3],[191,4,191,7],[192,2,192,3],[192,4,192,7],[193,2,193,3],[193,4,193,7],[195,2,195,3],[195,4,195,7],[195,11,195,12],[196,2,196,3],[196,4,196,7],[196,11,196,12],[197,2,197,3],[197,4,197,7],[198,2,198,3],[198,4,198,7],[198,11,198,12],[199,2,199,3],[199,4,199,7],[201,2,201,3],[203,11,203,12],[204,2,204,3],[204,5,204,7],[205,2,205,3],[206,2,206,3],[207,2,207,3],[208,2,208,3],[209,2,209,3],[211,2,211,3],[212,2,212,3],[212,4,212,7],[213,2,213,3],[213,4,213,7],[214,2,214,3],[214,4,214,7],[217,4,217,5],[217,8,217,9],[218,2,218,3],[218,4,218,5],[218,8,218,9],[219,2,219,3],[219,4,219,5],[219,8,219,9],[220,2,220,3],[220,4,220,5],[220,8,220,9],[221,2,221,3],[221,4,221,5],[222,8,222,9],[223,2,223,3],[223,8,223,9],[224,2,224,3],[225,2,225,3],[225,4,225,7],[226,2,226,3],[226,4,226,7],[227,2,227,3],[227,4,227,7],[230,4,230,5],[230,8,230,9],[231,2,231,3],[231,4,231,5],[231,8,231,9],[232,2,233,3],[232,4,232,5],[232,8,232,9],[233,4,233,5],[233,8,233,9],[234,2,234,3],[234,4,234,5],[236,2,236,3],[238,2,238,3],[238,4,238,7],[239,2,239,3],[239,4,239,7],[240,2,240,3],[240,4,240,7],[243,4,243,5],[243,8,243,9],[244,2,244,3],[244,4,244,5],[244,8,244,9],[245,2,246,3],[245,4,245,5],[245,8,245,9],[246,4,246,5],[246,8,246,9],[247,2,247,3],[247,4,247,5],[249,2,249,3],[251,2,251,3],[251,4,251,7],[252,2,252,3],[252,4,252,7],[253,2,253,3],[253,4,253,7],[256,4,256,5],[256,8,256,9],[257,2,257,3],[257,4,257,5],[257,8,257,9],[258,2,259,3],[258,4,258,5],[258,8,258,9],[259,4,259,5],[259,8,259,9],[260,2,260,3],[260,4,260,5],[262,2,262,3],[264,2,264,3],[264,4,264,7],[265,2,265,3],[265,4,265,7],[266,2,266,3],[266,4,266,7],[269,4,269,5],[269,8,269,9],[270,2,270,3],[270,4,270,5],[270,8,270,9],[271,2,272,3],[271,4,271,5],[271,8,271,9],[272,4,272,5],[272,8,272,9],[273,2,273,3],[273,4,273,5],[275,2,275,3],[277,2,277,3],[279,2,279,3],[279,4,279,7],[279,13,280,16],[280,2,280,3],[280,4,280,7],[283,2,283,16],[300,1,300,16]]}
[null,"Aquant 40: U-shower with 2 sliding sashes and corner entry"]
[]
[]
[null,{"$f":"corner_1_sash!B4","v":"Drawings"}]
{"$rows_empty":24}
[null,{"$f":"corner_1_sash!B29","v":"User input"},{"$nulls":5},{"$f":"corner_1_sash!H29","v":"Legend & Formulas"}]
[{"$nulls":8},"Legend\nW1 = System width of side 1 (max. 1500 mm)\nW2 = System width of side 2 (max. 1500 mm)\nH = System height (max. 2500 mm)\nLS1 = Length of track profile/cover profile 1\nLS2 = Length of track profile/cover profile 2\nLS3 = Length of track profile/cover profile 3\nLWt = Clearance with open door\n \nWS1 = Glass width of sliding sash 1 with handle\nWS2 = Glass width of sliding sash 2 with handle\nWSZ = Additional width of sliding sash for handle\nHS1 = Glass height of sliding sash 1\nHS2 = Glass height of sliding sash 2\n\nWF1 = Glass width of fixed sash 1\nWF2 = Glass width of fixed sash 2\nWFA = Allowance for fixed sash for wall attachment\nWFZ1 = Additional width of fixed sash 1\nWFZ2 = Additional width of fixed sash 2\nHF1 = Glass height of fixed sash 1\nHF2 = Glass height of fixed sash 2\nHF3 = Glass height of fixed sash 3\n\nUF = Overlap between sliding sash and fixed sash\n\nSMs = Size of gap on the closing side\nSMo1 = Size of gap on the opening side for sliding sash 1\nSMo2 = Size of gap on the opening side for sliding sash 2",{"$nulls":3},"Formulas"]
[null,null,"W1",{"$f":"'corner_2_sashes_corner entry'!D31","v":"System width of side 1 (max. 1,500 mm)"},{"v":1200,"d":"1,200"},"(mm)",{"$nulls":6},{"$f":"\"WS1 = (W1 - SMs - WFA - WFZ1 + UF + WSZ - \"&U3_Glasstärke&\") / 2\"","v":"WS1 = (W1 - SMs - WFA - WFZ1 + UF + WSZ - 8) / 2"}]
[{"$nulls":12},"WF1 = WS1 - WSZ + WFZ1"]
[null,null,"W2",{"$f":"corner_1_sash!D33","v":"System width of side 2 (max. 1,500 mm)"},{"v":1200,"d":"1,200"},"(mm)",{"$nulls":6},{"$f":"\"WS2 = (W2 - SMs - WFZ2 + UF + WSZ - \"&U3_Glasstärke&\") / 2\"","v":"WS2 = (W2 - SMs - WFZ2 + UF + WSZ - 8) / 2"}]
[{"$nulls":12},"WF2 = WS2 - WSZ + WFZ2"]
[null,null,"H",{"$f":"corner_1_sash!D35","v":"System height (max. 2,500 mm)"},{"v":2000,"d":"2,000"},"(mm)",{"$nulls":6},{"$f":"\"WF3 = W1 - WFA - \"&I93","v":"WF3 = W1 - WFA - 11"}]
[{"$nulls":12},{"$f":"\"HS1 = HS2 = H - \"&U3_HSA_System","v":"HS1 = HS2 = H - 30"}]
[null,null,"WFZ1",{"$f":"corner_1_sash!D37","v":"Additional width of fixed sash 1"},17,"(mm)",{"$nulls":6},{"$f":"\"HF1 = HF2 = HF3 = H- \"&U3_HFA_System","v":"HF1 = HF2 = HF3 = H- 42"}]
[{"$nulls":12},"SMo1 = WFZ1 + WFA"]
[null,null,"WFZ2",{"$f":"'corner_2_sashes_corner entry'!D39","v":"Additional width of fixed sash 2"},38,"(mm)",{"$nulls":6},{"$f":"\"SMo2 = WFZ2 - \"&U3_Glasstärke","v":"SMo2 = WFZ2 - 8"}]
[{"$nulls":12},{"$f":"\"LS1 = LS3 = W1 - \"&U3_Eckenabzug","v":"LS1 = LS3 = W1 - 49"}]
[null,null,"Do you wish to attach the fixed sash to the wall via a wall profile or directly via silicon?",null,"Silicon",{"$nulls":7},{"$f":"\"LS 2 = W2 - \"&I89","v":"LS 2 = W2 - 98"}]
[]
[]
[null,null,"Do you wish to use the Aquant floor profile?",null,"No"]
[]
[]
[null,null,"Do you wish to use vertical sealing strips between fixed and sliding sash?",null,"No"]
[]
[]
[null,null,"Do you wish to use an optional threshold profile in the door area (in addition to the obligatory drip rail)?"]
[]
[]
[{"$nulls":3},"No"]
[]
[]
[null,null,"Do you wish to use the Aquant magnetic seals 90°?",null,"Yes"]
[]
[]
[null,null,"Do you wish to use the Aquant finger pull handle?",null,"Yes"]
[]
[]
[]
[null,{"$f":"Haftungsausschluss","v":"Willach assumes no liability for damage of any kind that could arise as a result of using this profile and glass dimensions calculator. (11.05.2016 Rev. 3)"}]
[]
[null,{"$f":"corner_1_sash!B63","v":"System dimensions"}]
[]
[null,null,{"$f":"corner_1_sash!C65","v":"System dimensions specified/recommended by Willach"},{"$nulls":4},{"$f":"corner_1_sash!H65","v":"Deviations from system dimensions"}]
[]
[null,null,"HSA",{"$f":"corner_1_sash!D67","v":"Höhenabzugsmaß für Aufnahme Schiebeflügel"},30,"(mm)",null,{"$f":"corner_1_sash!H67","v":"Deviation from system dimension?"},{"$nulls":3},{"$f":"IF(OR(U3_HSA_Wunsch=\"\",U3_HSA_Wunsch=U3_HSA_System),\"Nein\",\"Ja\")","v":"Nein"},{"$f":"corner_1_sash!M67","v":"Desired value"},null,null,{"$f":"IF(OR(L69=\"Nein\",O69=\"\"),E69,O69)","v":30},"(mm)"]
[]
[null,null,"WSZ",{"$f":"corner_1_sash!D69","v":"Additional width of sliding sash for handle"},69,"(mm)",null,{"$f":"corner_1_sash!H69","v":"Deviation from system dimension?"},{"$nulls":3},{"$f":"IF(OR(U3_WSZ_Wunsch=\"\",U3_WSZ_Wunsch=U3_WSZ_System),\"Nein\",\"Ja\")","v":"Nein"},{"$f":"corner_1_sash!M69","v":"Desired value"},null,null,{"$f":"IF(OR(L71=\"Nein\",O71=\"\"),E71,O71)","v":69},"(mm)"]
[]
[null,null,"WFA",{"$f":"corner_1_sash!D71","v":"Allowance for fixed sash for wall attachment"},{"$f":"IF(E41=\"Profile\",14,3)","v":3},"(mm)",null,{"$f":"corner_1_sash!H71","v":"Deviation from system dimension?"},{"$nulls":3},{"$f":"IF(OR(U3_WFA_Wunsch=\"\",U3_WFA_Wunsch=U3_WFA_System),\"Nein\",\"Ja\")","v":"Nein"},{"$f":"corner_1_sash!M71","v":"Desired value"},null,null,{"$f":"IF(OR(L73=\"Nein\",O73=\"\"),E73,O73)","v":3},"(mm)"]
[]
[null,null,"HFA",{"$f":"corner_1_sash!D73","v":"Höhenabzugsmaß für Aufnahme Festflügel"},42,"(mm)",null,{"$f":"corner_1_sash!H73","v":"Deviation from system dimension?"},{"$nulls":3},{"$f":"IF(OR(U3_HFA_Wunsch=\"\",U3_HFA_Wunsch=U3_HFA_System),\"Nein\",\"Ja\")","v":"Nein"},{"$f":"corner_1_sash!M73","v":"Desired value"},null,null,{"$f":"IF(OR(L75=\"Nein\",O75=\"\"),E75,O75)","v":42},"(mm)"]
[]
[null,null,"UF",{"$f":"corner_1_sash!D75","v":"Overlap between sliding sash and fixed sash"},{"$f":"IF(E47=\"Yes\",5,35)","v":35},"(mm)",null,{"$f":"corner_1_sash!H75","v":"Deviation from system dimension?"},{"$nulls":3},{"$f":"IF(OR(U3_UF_Wunsch=\"\",U3_UF_Wunsch=U3_UF_System),\"Nein\",\"Ja\")","v":"Nein"},{"$f":"corner_1_sash!M75","v":"Desired value"},null,null,{"$f":"IF(OR(L77=\"Nein\",O77=\"\"),E77,O77)","v":35},"(mm)"]
[]
[null,null,"SMs",{"$f":"corner_1_sash!D77","v":"Size of gap on the closing side"},31,"(mm)",null,{"$f":"corner_1_sash!H77","v":"Deviation from system dimension?"},{"$nulls":3},{"$f":"IF(OR(U3_SMs_Wunsch=\"\",U3_SMs_Wunsch=U3_SMs_System),\"Nein\",\"Ja\")","v":"Nein"},{"$f":"corner_1_sash!M77","v":"Desired value"},null,null,{"$f":"IF(OR(L79=\"Nein\",O79=\"\"),E79,O79)","v":31},"(mm)"]
[]
[{"$nulls":3},{"$f":"corner_1_sash!D79&\" Schiebeflügel 1\"","v":"Vorgabe Mindest-Spaltmaß öffnungsseitig Schiebeflügel 1"},{"$f":"IF(U3_Wahl_Wandanschluss=\"Profile\",40,20)","v":20},"(mm)",null,{"$f":"corner_1_sash!H79","v":"Deviation from system dimension?"},{"$nulls":3},{"$f":"IF(OR(U3_SMo1_Wunsch=\"\",U3_SMo1_Wunsch=U3_SMo1_System),\"Nein\",\"Ja\")","v":"Nein"},{"$f":"recess_1_sash!M78","v":"Desired value"},null,null,{"$f":"IF(OR(L81=\"Nein\",O81=\"\"),E81,O81)","v":20},"(mm)"]
[]
[{"$nulls":3},{"$f":"corner_1_sash!D79&\" Schiebeflügel 2\"","v":"Vorgabe Mindest-Spaltmaß öffnungsseitig Schiebeflügel 2"},30,"(mm)",null,{"$f":"H81","v":"Deviation from system dimension?"},{"$nulls":3},{"$f":"IF(OR(U3_SMo2_Wunsch=\"\",U3_SMo2_Wunsch=U3_SMo2_System),\"Nein\",\"Ja\")","v":"Nein"},{"$f":"M81","v":"Desired value"},null,null,{"$f":"IF(OR(L83=\"Nein\",O83=\"\"),E83,O83)","v":30},"(mm)"]
[]
[{"$nulls":3},{"$f":"corner_1_sash!D81","v":"Weight of Aquant handle"},0.2,"(kg)",null,{"$f":"corner_1_sash!H81","v":"Deviation from system dimension?"},{"$nulls":3},{"$f":"IF(OR(U3_Gewicht_Griff_Wunsch=\"\",U3_Gewicht_Griff_Wunsch=U3_Gewicht_Griff),\"Nein\",\"Ja\")","v":"Nein"},{"$f":"corner_1_sash!M81","v":"Desired value"},null,null,{"$f":"IF(OR(L85=\"Nein\",O85=\"\"),E85,O85)","v":0.2},"(kg)"]
[]
[{"$nulls":3},"Glasstärke",8,"(mm)"]
[]
[{"$nulls":3},"Eckenabzug",49,"(mm)",null,null,{"$f":"U3_Eckenabzug*2","v":98}]
[]
[{"$nulls":3},"Glasscheibenabstand",15,"(mm)"]
[]
[{"$nulls":3},"Silikon zw. zwei Festflügeln",3,"(mm)",null,null,{"$f":"E93+U3_Glasstärke","v":11}]
[]
[null,null,{"$f":"IF(OR(L69=\"Ja\",L73=\"Ja\",L75=\"Ja\",L77=\"Ja\",L79=\"Ja\",L81=\"Ja\", L83=\"Ja\",L71=\"Ja\",L85=\"Ja\"),\"Caution: you are deviating from the suggested system dimension, please check whether the system can be built with the value you have selected!\",\"\")","v":""}]
[]
[]
[]
[null,{"$f":"corner_1_sash!B93","v":"Automatic calculation of glass dimensions and profile lengths*"},{"$nulls":5},{"$f":"corner_1_sash!H93","v":"Automatic check of door sash width, sash weight, aspect ratio and gap dimension on the opening side"}]
[]
[null,null,{"$f":"'corner_2_sashes_corner entry'!C97","v":"Glass dimensions of sliding sash 1"},{"$nulls":5},{"$f":"'corner_2_sashes_corner entry'!I97:Q97","v":"Check of the door sash width"}]
[]
[null,null,"WS1",{"$f":"'corner_2_sashes_corner entry'!D99","v":"Glass width of sliding sash 1 with handle"},{"$f":"(U3_W1-U3_SMs_final-U3_WFA_final-U3_WFZ1+U3_UF_final+U3_WSZ_final-U3_Glasstärke)/2","v":{"v":622.5,"d":"623"}},"(mm)",null,null,"WS1",{"$f":"D103","v":"Glass width of sliding sash 1 with handle"},null,{"$f":"U3_WS1","v":{"v":622.5,"d":"623"}},"≥",380,"(mm)",null,{"$f":"IF(L103>=N103,\"Yes\",\"No\")","v":"Yes"}]
[]
[null,null,"HS",{"$f":"corner_1_sash!D99","v":"Glass height of sliding sash 1"},{"$f":"U3_H-U3_HSA_final","v":{"v":1970,"d":"1,970"}},"(mm)",null,null,"WS2",{"$f":"D112","v":"Glass width of sliding sash 2 with handle"},null,{"$f":"U3_WS2","v":{"v":613.5,"d":"614"}},"≥",380,"(mm)",null,{"$f":"IF(L105>=N105,\"Yes\",\"No\")","v":"Yes"}]
[]
[null,null,"Please note that drill holes are required, please refer to the relevant drilling drawings!",{"$nulls":5},{"$f":"corner_1_sash!I99","v":"Check of the sash weight"}]
[]
[{"$nulls":9},{"$f":"'corner_2_sashes_corner entry'!J105:K105","v":"Weight of sliding sash 1"},null,{"$f":"ROUND(U3_WS1/1000*U3_HS/1000*2.5*U3_Glasstärke+U3_Gewicht_Griff_final,0)","v":25},"≤",40,"(kg)",null,{"$f":"IF(L109<=N109,\"Yes\",\"No\")","v":"Yes"}]
[null,null,{"$f":"'corner_2_sashes_corner entry'!C106:E106","v":"Glass dimensions of sliding sash 2"}]
[{"$nulls":9},{"$f":"'corner_2_sashes_corner entry'!J107","v":"Weight of sliding sash 2"},null,{"$f":"ROUND(U3_WS2/1000*U3_HS/1000*2.5*U3_Glasstärke+U3_Gewicht_Griff_final,0)","v":24},"≤",40,"(kg)",null,{"$f":"IF(OR(L111<N111,L111=N111),\"Yes\",\"No\")","v":"Yes"}]
[null,null,"WS2",{"$f":"'corner_2_sashes_corner entry'!D108","v":"Glass width of sliding sash 2 with handle"},{"$f":"(U3_W2-U3_SMs_final-U3_WFZ2+U3_UF_final+U3_WSZ_final-U3_Glasstärke)/2","v":{"v":613.5,"d":"614"}},"(mm)"]
[{"$nulls":8},{"$f":"corner_1_sash!I103","v":"Check of the aspect ratio"}]
[null,null,"HS",{"$f":"'corner_2_sashes_corner entry'!D110","v":"Glass height of sliding sash 2"},{"$f":"U3_HS","v":{"v":1970,"d":"1,970"}},"(mm)"]
[{"$nulls":9},{"$f":"corner_1_sash!J105","v":"Height-to-width ratio of sliding sash 1"},null,{"$f":"ROUND(U3_HS/U3_WS1,2)","v":3.16},"≤",5,null,null,{"$f":"IF(L115<=N115,\"Yes\",\"No\")","v":"Yes"}]
[null,null,"Please note that drill holes are required, please refer to the relevant drilling drawings!"]
[]
[{"$nulls":9},{"$f":"'corner_2_sashes_corner entry'!J114","v":"Height-to-width ratio of sliding sash 2"},null,{"$f":"ROUND(E114/U3_WS2,2)","v":3.21},"≤",5,null,null,{"$f":"IF(L118<=N118,\"Yes\",\"No\")","v":"Yes"}]
[null,null,{"$f":"corner_1_sash!C104","v":"Glass dimensions of fixed sash 1"}]
[]
[null,null,"WF1",{"$f":"'corner_2_sashes_corner entry'!D117","v":"Glass width of fixed sash 1"},{"$f":"ROUNDDOWN(U3_WS1-U3_WSZ_final+U3_WFZ1,0)","v":570},"(mm)",null,null,{"$f":"corner_1_sash!I108","v":"Check of the gap dimension on the opening side"}]
[]
[null,null,"HF",{"$f":"'corner_2_sashes_corner entry'!D119","v":"Glass height of fixed sash 1"},{"$f":"U3_H-U3_HFA_final","v":{"v":1958,"d":"1,958"}},"(mm)",null,null,"SMo1",{"$f":"'corner_2_sashes_corner entry'!J119:K119","v":" Gap dimension on the opening side for sliding sash 1"},null,{"$f":"U3_WFZ1+U3_WFA_final","v":20},"≥",{"$f":"P81","v":20},"(mm)",null,{"$f":"IF(L123>=N123,\"Yes\",\"No\")","v":"Yes"}]
[{"$nulls":8},"SMo2",{"$f":"'corner_2_sashes_corner entry'!J120:K120","v":" Gap dimension on the opening side for sliding sash 2"},null,{"$f":"U3_WFZ2-U3_Glasstärke","v":30},"≥",{"$f":"P83","v":30},"(mm)",null,{"$f":"IF(L124>=N124,\"Yes\",\"No\")","v":"Yes"}]
[null,null,{"$f":"corner_1_sash!C110","v":"Glass dimensions of fixed sash 2"},{"$nulls":5},{"$f":"IF(OR(Q123=\"No\",Q124=\"No\"),\"Note: if the gap on the opening side is too small , please increase WFZ1 or WFZ2.\",\"\")","v":""}]
[]
[null,null,"WF2",{"$f":"'corner_2_sashes_corner entry'!D123","v":"Glass width of fixed sash 2"},{"$f":"ROUNDDOWN(U3_WS2+U3_WFZ2-U3_WSZ_final,0)","v":582},"(mm)"]
[{"$nulls":8},{"$f":"IF(OR(Q103=\"No\",Q105=\"No\",Q109=\"No\",Q111=\"No\",Q115=\"No\",Q118=\"No\",Q123=\"No\",Q124=\"No\"),\"Caution: the technical restrictions have not been observed; please change your planning!\",\"\")","v":""}]
[null,null,"HF",{"$f":"'corner_2_sashes_corner entry'!D125","v":"Glass height of fixed sash 2"},{"$f":"U3_HF","v":{"v":1958,"d":"1,958"}},"(mm)"]
[]
[null,null,{"$f":"'U-shower_1_sash_side'!C119","v":"Glass dimensions of fixed sash 3"}]
[]
[null,null,"WF3",{"$f":"'U-shower_1_sash_side'!D121","v":"Glass width of fixed sash 3"},{"$f":"U3_W1-U3_WFA_final-I93","v":{"v":1186,"d":"1,186"}},"(mm)"]
[]
[null,null,"HF",{"$f":"'U-shower_1_sash_side'!D123","v":"Glass height of fixed sash 3"},{"$f":"U3_HF","v":{"v":1958,"d":"1,958"}},"(mm)"]
[]
[null,null,{"$f":"corner_2_sashes_on_one_side!C161","v":"Length of track profile/cover profile 1"}]
[]
[null,null,"LS1",{"$f":"'U-shower_1_sash_front'!D127","v":"Length of track profile/cover profile 1"},{"$f":"U3_W1-U3_Eckenabzug","v":{"v":1151,"d":"1,151"}},"(mm)"]
[]
[null,null,{"$f":"'corner_2_sashes_corner entry'!C131:E131","v":"Length of track profile/cover profile 2"}]
[]
[null,null,"LS2",{"$f":"'U-shower_1_sash_front'!D131","v":"Length of track profile/cover profile 2"},{"$f":"U3_W2-(2*U3_Eckenabzug)","v":{"v":1102,"d":"1,102"}},"(mm)"]
[]
[null,null,{"$f":"'U-shower_1_sash_side'!C133","v":"Length of track profile/cover profile 3"}]
[]
[null,null,"LS3",{"$f":"'U-shower_1_sash_side'!D135","v":"Length of track profile/cover profile 3"},{"$f":"U3_LS1","v":{"v":1151,"d":"1,151"}},"(mm)"]
[]
[null,null,{"$f":"'corner_2_sashes_corner entry'!C135:E135","v":"For information: clearance with open doors"}]
[]
[null,null,"LWt",{"$f":"'corner_2_sashes_corner entry'!D137","v":"Clearance with open doors"},{"$f":"((U3_W1-U3_WFA_final-U3_WF1-U3_WSZ_final-2*U3_Glasstärke-U3_Glasscheibenabstand)^2+(U3_W2-U3_WF2-U3_WSZ_final-2*U3_Glasstärke-U3_Glasscheibenabstand)^2)^0.5","v":{"v":738.9539904486611,"d":"739"}},"(mm)"]
[]
[]
[null,{"$f":"Haftungsausschluss","v":"Willach assumes no liability for damage of any kind that could arise as a result of using this profile and glass dimensions calculator. (11.05.2016 Rev. 3)"}]
[]
[null,{"$f":"corner_1_sash!B131","v":"Order list"}]
[]
[null,null,{"$f":"corner_1_sash!C133","v":"Profile sets"}]
[]
[null,null,{"$f":"corner_1_sash!C135","v":"Description"},null,{"$f":"corner_1_sash!E135","v":"Article number"},{"$nulls":3},{"$f":"corner_1_sash!I135","v":"Quantity"},{"$f":"corner_1_sash!J135","v":"Unit"},{"$f":"corner_1_sash!K135","v":"Sales length"},{"$f":"corner_1_sash!L135","v":"Cut length*"}]
[null,null,{"$f":"'U-shower_1_sash_side'!C149:D149","v":"Profile set for side 1"},null,{"$f":"IF(K161<1000,\"612 070.0\"&K161&\".111\",\"612 070.\"&K161&\".111\")","v":"612 070.1550.111"},{"$nulls":3},1,{"$f":"'U-shower_1_sash_side'!J149","v":"piece"},{"$f":"VLOOKUP(L161,$E$285:$I$289,2,TRUE)","v":{"v":1550,"d":"1,550 mm"}},{"$f":"U3_LS1","v":{"v":1151,"d":"1,151 mm"}}]
[null,null,{"$f":"'U-shower_1_sash_side'!C150:D150","v":"Profile set for side 2"},null,{"$f":"IF(K162<1000,\"612 070.0\"&K162&\".111\",\"612 070.\"&K162&\".111\")","v":"612 070.1150.111"},{"$nulls":3},1,{"$f":"J161","v":"piece"},{"$f":"VLOOKUP(L162,$E$285:$I$289,2,TRUE)","v":{"v":1150,"d":"1,150 mm"}},{"$f":"U3_LS2","v":{"v":1102,"d":"1,102 mm"}}]
[null,null,{"$f":"'U-shower_1_sash_side'!C151:D151","v":"Profile set for side 3"},null,{"$f":"IF(K163<1000,\"612 070.0\"&K163&\".111\",\"612 070.\"&K163&\".111\")","v":"612 070.1550.111"},{"$nulls":3},1,{"$f":"J162","v":"piece"},{"$f":"VLOOKUP(L163,$E$285:$I$289,2,TRUE)","v":{"v":1550,"d":"1,550 mm"}},{"$f":"U3_LS3","v":{"v":1151,"d":"1,151 mm"}}]
[]
[null,null,{"$f":"corner_1_sash!C140","v":"Accessory kits"}]
[]
[null,null,{"$f":"corner_1_sash!C142","v":"Description"},null,{"$f":"corner_1_sash!E142","v":"Article number"},{"$nulls":3},{"$f":"corner_1_sash!I142","v":"Quantity"},{"$f":"corner_1_sash!J142","v":"Unit"}]
[null,null,{"$f":"'U-shower_1_sash_side'!C157:D157","v":"Accessory kit door sash 20 kg"},null,"612 002.0000.000",{"$nulls":3},{"$f":"IF(AND(U3_Flügelgewicht_1<=20,U3_Flügelgewicht_2<=20),2,IF(OR(U3_Flügelgewicht_1<=20,U3_Flügelgewicht_2<=20),1,0))","v":0},{"$f":"corner_1_sash!J143","v":"piece"}]
[null,null,{"$f":"'U-shower_1_sash_side'!C158:D158","v":"Accessory kit door sash 40 kg"},null,"612 004.0000.000",{"$nulls":3},{"$f":"IF(AND(U3_Flügelgewicht_1>20,U3_Flügelgewicht_2>20),2,IF(OR(U3_Flügelgewicht_1>20,U3_Flügelgewicht_2>20),1,0))","v":2},{"$f":"corner_1_sash!J144","v":"piece"}]
[null,null,{"$f":"corner_1_sash!C145","v":"Accessory kit installation"},null,"612 010.0000.000",{"$nulls":3},1,{"$f":"corner_1_sash!J145","v":"piece"}]
[null,null,{"$f":"corner_1_sash!C146","v":"Accessory kit corner bracket"},null,"612 020.0000.000",{"$nulls":3},2,{"$f":"corner_1_sash!J146","v":"piece"}]
[]
[null,null,{"$f":"corner_1_sash!C148","v":"Sealing strips (optional, please see above to select or deselect)"}]
[]
[null,null,{"$f":"corner_1_sash!C150","v":"Description"},null,{"$f":"corner_1_sash!E150","v":"Article number"},{"$nulls":3},{"$f":"corner_1_sash!I150","v":"Quantity"},{"$f":"corner_1_sash!J150","v":"Unit"},{"$f":"corner_1_sash!K150","v":"Sales length"},{"$f":"corner_1_sash!L150","v":"Cut length*"}]
[null,null,{"$f":"'corner_2_sashes_corner entry'!C161:D161","v":"Magnetic seals 90°"},null,{"$f":"\"612 420.\"&K176&\".305\"","v":"612 420.2000.305"},{"$nulls":3},{"$f":"IF(U3_Wahll_Dichtl_schließseitig=\"Yes\",1,0)","v":1},{"$f":"'corner_2_sashes_corner entry'!J161","v":"pair"},{"$f":"VLOOKUP(L176,$E$291:$I$292,2,TRUE)","v":{"v":2000,"d":"2,000 mm"}},{"$f":"U3_HS","v":{"v":1970,"d":"1,970 mm"}}]
[null,null,{"$f":"corner_1_sash!C152","v":"Vertical sealing strips between fixed and sliding sash"},null,{"$f":"\"612 440.\"&K177&\".305\"","v":"612 440.2000.305"},{"$nulls":3},{"$f":"IF(U3_Wahl_Dichtl_F_u_S=\"Yes\",2,0)","v":0},{"$f":"corner_1_sash!J152","v":"pair"},{"$f":"VLOOKUP(L177,$E$291:$I$292,2,TRUE)","v":{"v":2000,"d":"2,000 mm"}},{"$f":"U3_HF-24","v":{"v":1934,"d":"1,934 mm"}}]
[]
[null,null,{"$f":"corner_1_sash!C154","v":"Threshold profile (optional, please see above to select or deselect)"}]
[]
[null,null,{"$f":"corner_1_sash!C156","v":"Description"},null,{"$f":"corner_1_sash!E156","v":"Article number"},{"$nulls":3},{"$f":"corner_1_sash!I156","v":"Quantity"},{"$f":"corner_1_sash!J156","v":"Unit"},{"$f":"corner_1_sash!K156","v":"Sales length"},{"$f":"corner_1_sash!L156","v":"Cut length*"}]
[null,null,{"$f":"'corner_2_sashes_corner entry'!C167:D167","v":"Threshold profile, bevelled on one side, gloss-polished aluminium"},null,"612 454.1000.111",{"$nulls":3},{"$f":"IF(U3_Wahl_Schwallschutz=\"Yes, made of gloss-polished aluminium\",1,0)","v":0},{"$f":"corner_1_sash!J157","v":"piece"},"1000 mm",{"$f":"U3_W1-U3_WF1-U3_WFA_final","v":{"v":627,"d":"627 mm"}},{"$f":"U3_W2-U3_WF2-U3","v":{"v":618,"d":"618 mm"}}]
[null,null,{"$f":"'corner_2_sashes_corner entry'!C168:D168","v":"Threshold profile, bevelled on one side, transparent plastic"},null,"612 454.1000.305",{"$nulls":3},{"$f":"IF(U3_Wahl_Schwallschutz=\"Yes, made of transparent plastic\",1,0)","v":0},{"$f":"corner_1_sash!J158","v":"piece"},"1000 mm",{"$f":"U3_W1-U3_WF1-U3_WFA_final","v":{"v":627,"d":"627 mm"}},{"$f":"U3_W2-U3_WF2","v":{"v":618,"d":"618 mm"}}]
[]
[null,null,{"$f":"corner_1_sash!C160","v":"Wall profile (optional, please see above to select or deselect)"}]
[]
[null,null,{"$f":"corner_1_sash!C162","v":"Description"},null,{"$f":"corner_1_sash!E162","v":"Article number"},{"$nulls":3},{"$f":"corner_1_sash!I162","v":"Quantity"},{"$f":"corner_1_sash!J162","v":"Unit"},{"$f":"corner_1_sash!K162","v":"Sales length"},{"$f":"corner_1_sash!L162","v":"Cut length*"}]
[null,null,{"$f":"corner_1_sash!C163","v":"Wall profile incl. plastic insert"},null,{"$f":"\"612 520.\"&K188&\".111\"","v":"612 520.2000.111"},{"$nulls":3},{"$f":"IF(U3_Wahl_Wandanschluss=\"Profile\",2,0)","v":0},{"$f":"corner_1_sash!J163","v":"piece"},{"$f":"VLOOKUP(L188,$E$291:$I$292,2,TRUE)","v":{"v":2000,"d":"2,000 mm"}},{"$f":"U3_H-50","v":{"v":1950,"d":"1,950 mm"}}]
[]
[null,null,{"$f":"corner_1_sash!C165","v":"Floor profile (optional, please see above to select or deselect)"}]
[]
[null,null,{"$f":"corner_1_sash!C162","v":"Description"},null,{"$f":"corner_1_sash!E162","v":"Article number"},{"$nulls":3},{"$f":"corner_1_sash!I162","v":"Quantity"},{"$f":"corner_1_sash!J167","v":"Unit"},{"$f":"corner_1_sash!K167","v":"Sales length"}]
[null,null,{"$f":"corner_1_sash!C168","v":"Floor profile length 1000 mm"},null,{"$f":"\"612 530.\"&K193&\".111\"","v":"612 530.1000.111"},{"$nulls":3},{"$f":"IF(U3_Wahl_Bodenprofil=\"Yes\",VLOOKUP(\"Ja\",$K$206:$M$210,2,0),0)","v":0},{"$f":"corner_1_sash!J168","v":"piece"},{"v":1000,"d":"1,000 mm"}]
[null,null,{"$f":"corner_1_sash!C169","v":"Floor profile length 1500 mm"},null,{"$f":"\"612 530.\"&K194&\".111\"","v":"612 530.1500.111"},{"$nulls":3},{"$f":"IF(U3_Wahl_Bodenprofil=\"Yes\",VLOOKUP(\"Ja\",$K$206:$M$210,3,0),0)","v":0},{"$f":"corner_1_sash!J169","v":"piece"},{"v":1500,"d":"1,500 mm"}]
[]
[null,null,{"$f":"corner_1_sash!C171","v":"Description"},null,{"$f":"corner_1_sash!E171","v":"Glass width of fixed sashes"}]
[null,null,{"$f":"'U-shower_1_sash_side'!C186:D186","v":"Approximate required length of floor profile for fixed sash 1"},null,{"$f":"U3_WF1","v":{"v":570,"d":"570 mm"}}]
[null,null,{"$f":"'U-shower_1_sash_side'!C187:D187","v":"Approximate required length of floor profile for fixed sash 2"},null,{"$f":"U3_WF2","v":{"v":582,"d":"582 mm"}}]
[null,null,{"$f":"'U-shower_1_sash_side'!C188:D188","v":"Approximate required length of floor profile for fixed sash 3"},null,{"$f":"U3_WF3","v":{"v":1186,"d":"1,186 mm"}}]
[null,null,{"$f":"'U-shower_1_sash_side'!C189:D189","v":"Approximate required total length of floor profile"},null,{"$f":"SUM(E197:H199)","v":{"v":2338,"d":"2,338 mm"}}]
[]
[null,null,"Kaufvarianten"]
[]
[{"$nulls":11},"Im Minimum-Fall"]
[null,null,"Zusammenfassung",{"$nulls":5},"Preis Summe","Mögl.?","Minimum und möglich?","Anzahl 1000 mm","Anzahl 1500 mm"]
[null,null,{"$f":"C213","v":"Variante 1: Alle einzeln"},{"$nulls":5},{"$f":"IF(J206=\"Ja\",M216,\"n.a.\")","v":{"v":112.77,"d":"113"}},{"$f":"E224","v":"Ja"},{"$f":"IF(AND(I206=MIN(I206:I210),J206=\"Ja\"),\"Ja\",\"Nein\")","v":"Nein"},{"$f":"IF(K206=\"Ja\",I214,0)","v":0},{"$f":"IF(K206=\"Ja\",I215,0)","v":0}]
[null,null,{"$f":"C226","v":"Variante 2: Festflügel 1 einzeln, Rest zusammen"},{"$nulls":5},{"$f":"IF(J207=\"Ja\",M229,\"n.a.\")","v":"n.a."},{"$f":"E237","v":"Nein"},{"$f":"IF(AND(I207=MIN(I206:I210),J207=\"Ja\"),\"Ja\",\"Nein\")","v":"Nein"},{"$f":"IF(K207=\"Ja\",I227,0)","v":0},{"$f":"IF(K207=\"Ja\",I228,0)","v":0}]
[null,null,{"$f":"C239","v":"Variante 3: Festflügel 2 einzeln, Rest zusammen"},{"$nulls":5},{"$f":"IF(J208=\"Ja\",M242,\"n.a.\")","v":"n.a."},{"$f":"E250","v":"Nein"},{"$f":"IF(AND(I208=MIN(I206:I210),J208=\"Ja\"),\"Ja\",\"Nein\")","v":"Nein"},{"$f":"IF(K208=\"Ja\",I240,0)","v":0},{"$f":"IF(K208=\"Ja\",I241,0)","v":0}]
[null,null,{"$f":"C252","v":"Variante 4: Festflügel 3 einzeln, Rest zusammen"},{"$nulls":5},{"$f":"IF(J209=\"Ja\",M255,\"n.a.\")","v":{"v":96.66,"d":"97"}},{"$f":"E263","v":"Ja"},{"$f":"IF(AND(I209=MIN(I206:I210),J209=\"Ja\"),\"Ja\",\"Nein\")","v":"Ja"},{"$f":"IF(K209=\"Ja\",I253,0)","v":0},{"$f":"IF(K209=\"Ja\",I254,0)","v":2}]
[null,null,{"$f":"C265","v":"Variante 5: Alle zusammen"},{"$nulls":5},{"$f":"IF(J210=\"Ja\",M268,\"n.a.\")","v":"n.a."},{"$f":"E276","v":"Nein"},{"$f":"IF(AND(I210=MIN(I206:I210),J210=\"Ja\"),\"Ja\",\"Nein\")","v":"Nein"},{"$f":"IF(K210=\"Ja\",I266,0)","v":0},{"$f":"IF(K210=\"Ja\",I267,0)","v":0}]
[]
[]
[null,null,"Variante 1: Alle einzeln",null,"Artikelnummer",{"$nulls":3},"Anzahl","Einheit","Verkaufslänge","Brutto-VK-Preis","Summe Brutto-VK-Preis"]
[null,null,"Anzahl benötigter Bodenprofile in Länge 1000 mm",null,{"$f":"\"612 XXX.\"&K214&\".111\"","v":"612 XXX.1000.111"},{"$nulls":3},{"$f":"COUNTIF(I219:J221,K214)","v":2},"Stück",{"v":1000,"d":"1,000 mm"},{"$f":"$F$297","v":{"v":32.22,"d":"32.22 €"}},{"$f":"I214*L214","v":{"v":64.44,"d":"64.44 €"}}]
[null,null,"Anzahl benötigter Bodenprofile in Länge 1500 mm",null,{"$f":"\"612 XXX.\"&K215&\".111\"","v":"612 XXX.1500.111"},{"$nulls":3},{"$f":"COUNTIF(I219:J221,K215)","v":1},"Stück",{"v":1500,"d":"1,500 mm"},{"$f":"$F$298","v":{"v":48.33,"d":"48.33 €"}},{"$f":"I215*L215","v":{"v":48.33,"d":"48.33 €"}}]
[{"$nulls":12},{"$f":"M214+M215","v":{"v":112.77,"d":"112.77 €"}}]
[]
[{"$nulls":4},"Länge ben.",{"$nulls":3},"Verkaufslänge"]
[null,null,"Bodenprofil bei Festflügel 1",null,{"$f":"E197","v":{"v":570,"d":"570 mm"}},{"$nulls":3},{"$f":"IF(E219<=1500,VLOOKUP(E219,$E$294:$I$295,2,TRUE),\"nicht vorhanden\")","v":{"v":1000,"d":"1,000 mm"}}]
[null,null,"Bodenprofil bei Festflügel 2",null,{"$f":"E198","v":{"v":582,"d":"582 mm"}},{"$nulls":3},{"$f":"IF(E220<=1500,VLOOKUP(E220,$E$294:$I$295,2,TRUE),\"nicht vorhanden\")","v":{"v":1000,"d":"1,000 mm"}}]
[null,null,"Bodenprofil bei Festflügel 3",null,{"$f":"E199","v":{"v":1186,"d":"1,186 mm"}},{"$nulls":3},{"v":1500,"d":"1,500 mm"}]
[null,null,"Summe",null,{"$f":"SUM(E219:F221)","v":{"v":2338,"d":"2,338 mm"}}]
[]
[null,null,"Ist die Variante eine mögliche Lösung?",null,{"$f":"IF(OR(I219=\"nicht vorhanden\",I220=\"nicht vorhanden\",I221=\"nicht vorhanden\"),\"Nein\",\"Ja\")","v":"Ja"}]
[]
[null,null,"Variante 2: Festflügel 1 einzeln, Rest zusammen",null,"Artikelnummer",{"$nulls":3},"Anzahl","Einheit","Verkaufslänge","Brutto-VK-Preis","Summe Brutto-VK-Preis"]
[null,null,"Anzahl benötigter Bodenprofile in Länge 1000 mm",null,{"$f":"\"612 XXX.\"&K227&\".111\"","v":"612 XXX.1000.111"},{"$nulls":3},{"$f":"COUNTIF(H232:I234,K227)","v":1},"Stück",{"v":1000,"d":"1,000 mm"},{"$f":"$F$297","v":{"v":32.22,"d":"32.22 €"}},{"$f":"I227*L227","v":{"v":32.22,"d":"32.22 €"}}]
[null,null,"Anzahl benötigter Bodenprofile in Länge 1500 mm",null,{"$f":"\"612 XXX.\"&K228&\".111\"","v":"612 XXX.1500.111"},{"$nulls":3},{"$f":"COUNTIF(H232:I234,K228)","v":0},"Stück",{"v":1500,"d":"1,500 mm"},{"$f":"$F$298","v":{"v":48.33,"d":"48.33 €"}},{"$f":"I228*L228","v":0}]
[{"$nulls":12},{"$f":"M227+M228","v":{"v":32.22,"d":"32.22 €"}}]
[]
[{"$nulls":4},"Länge ben.",{"$nulls":3},"Verkaufslänge"]
[null,null,"Ungefähr benötigte Länge an Bodenprofil bei Festflügel 1",null,{"$f":"E197","v":{"v":570,"d":"570 mm"}},{"$nulls":3},{"$f":"IF(E232<=1500,VLOOKUP(E232,$E$294:$I$295,2,TRUE),\"nicht vorhanden\")","v":{"v":1000,"d":"1,000 mm"}}]
[null,null,"Ungefähr in Summe benötigte Länge an Bodenprofil für Festflügel 2 und Festflügel 3 in Summe",null,{"$f":"E198+E199","v":{"v":1768,"d":"1,768 mm"}},{"$nulls":3},{"$f":"IF(E233<=1500,VLOOKUP(E233,$E$294:$I$295,2,TRUE),\"nicht vorhanden\")","v":"nicht vorhanden"}]
[]
[null,null,"Summe",null,{"$f":"SUM(E232:F234)","v":{"v":2338,"d":"2,338 mm"}}]
[]
[null,null,"Ist die Variante eine mögliche Lösung?",null,{"$f":"IF(OR(I232=\"nicht vorhanden\",I233=\"nicht vorhanden\",I234=\"nicht vorhanden\"),\"Nein\",\"Ja\")","v":"Nein"}]
[]
[null,null,"Variante 3: Festflügel 2 einzeln, Rest zusammen",null,"Artikelnummer",{"$nulls":3},"Anzahl","Einheit","Verkaufslänge","Brutto-VK-Preis","Summe Brutto-VK-Preis"]
[null,null,"Anzahl benötigter Bodenprofile in Länge 1000 mm",null,{"$f":"\"612 XXX.\"&K240&\".111\"","v":"612 XXX.1000.111"},{"$nulls":3},{"$f":"COUNTIF(H245:I247,K240)","v":1},"Stück",{"v":1000,"d":"1,000 mm"},{"$f":"$F$297","v":{"v":32.22,"d":"32.22 €"}},{"$f":"I240*L240","v":{"v":32.22,"d":"32.22 €"}}]
[null,null,"Anzahl benötigter Bodenprofile in Länge 1500 mm",null,{"$f":"\"612 XXX.\"&K241&\".111\"","v":"612 XXX.1500.111"},{"$nulls":3},{"$f":"COUNTIF(H245:I247,K241)","v":0},"Stück",{"v":1500,"d":"1,500 mm"},{"$f":"$F$298","v":{"v":48.33,"d":"48.33 €"}},{"$f":"I241*L241","v":0}]
[{"$nulls":12},{"$f":"M240+M241","v":{"v":32.22,"d":"32.22 €"}}]
[]
[{"$nulls":4},"Länge ben.",{"$nulls":3},"Verkaufslänge"]
[null,null,"Ungefähr benötigte Länge an Bodenprofil bei Festflügel 2",null,{"$f":"E198","v":{"v":582,"d":"582 mm"}},{"$nulls":3},{"$f":"IF(E245<=1500,VLOOKUP(E245,$E$294:$I$295,2,TRUE),\"nicht vorhanden\")","v":{"v":1000,"d":"1,000 mm"}}]
[null,null,"Ungefähr in Summe benötigte Länge an Bodenprofil für Festflügel 1 und Festflügel 3 in Summe",null,{"$f":"E197+E199","v":{"v":1756,"d":"1,756 mm"}},{"$nulls":3},{"$f":"IF(E246<=1500,VLOOKUP(E246,$E$294:$I$295,2,TRUE),\"nicht vorhanden\")","v":"nicht vorhanden"}]
[]
[null,null,"Summe",null,{"$f":"SUM(E245:F247)","v":{"v":2338,"d":"2,338 mm"}}]
[]
[null,null,"Ist die Variante eine mögliche Lösung?",null,{"$f":"IF(OR(I245=\"nicht vorhanden\",I246=\"nicht vorhanden\",I247=\"nicht vorhanden\"),\"Nein\",\"Ja\")","v":"Nein"}]
[]
[null,null,"Variante 4: Festflügel 3 einzeln, Rest zusammen",null,"Artikelnummer",{"$nulls":3},"Anzahl","Einheit","Verkaufslänge","Brutto-VK-Preis","Summe Brutto-VK-Preis"]
[null,null,"Anzahl benötigter Bodenprofile in Länge 1000 mm",null,{"$f":"\"612 XXX.\"&K253&\".111\"","v":"612 XXX.1000.111"},{"$nulls":3},{"$f":"COUNTIF(H258:I260,K253)","v":0},"Stück",{"v":1000,"d":"1,000 mm"},{"$f":"$F$297","v":{"v":32.22,"d":"32.22 €"}},{"$f":"I253*L253","v":0}]
[null,null,"Anzahl benötigter Bodenprofile in Länge 1500 mm",null,{"$f":"\"612 XXX.\"&K254&\".111\"","v":"612 XXX.1500.111"},{"$nulls":3},{"$f":"COUNTIF(H258:I260,K254)","v":2},"Stück",{"v":1500,"d":"1,500 mm"},{"$f":"$F$298","v":{"v":48.33,"d":"48.33 €"}},{"$f":"I254*L254","v":{"v":96.66,"d":"96.66 €"}}]
[{"$nulls":12},{"$f":"M253+M254","v":{"v":96.66,"d":"96.66 €"}}]
[]
[{"$nulls":4},"Länge ben.",{"$nulls":3},"Verkaufslänge"]
[null,null,"Ungefähr benötigte Länge an Bodenprofil bei Festflügel 3",null,{"$f":"E199","v":{"v":1186,"d":"1,186 mm"}},{"$nulls":3},{"$f":"IF(E258<=1500,VLOOKUP(E258,$E$294:$I$295,2,TRUE),\"nicht vorhanden\")","v":{"v":1500,"d":"1,500 mm"}}]
[null,null,"Ungefähr in Summe benötigte Länge an Bodenprofil für Festflügel 1 und Festflügel 2 in Summe",null,{"$f":"E197+E198","v":{"v":1152,"d":"1,152 mm"}},{"$nulls":3},{"$f":"IF(E259<=1500,VLOOKUP(E259,$E$294:$I$295,2,TRUE),\"nicht vorhanden\")","v":{"v":1500,"d":"1,500 mm"}}]
[]
[null,null,"Summe",null,{"$f":"SUM(E258:F260)","v":{"v":2338,"d":"2,338 mm"}}]
[]
[null,null,"Ist die Variante eine mögliche Lösung?",null,{"$f":"IF(OR(I258=\"nicht vorhanden\",I259=\"nicht vorhanden\",I260=\"nicht vorhanden\"),\"Nein\",\"Ja\")","v":"Ja"}]
[]
[null,null,"Variante 5: Alle zusammen",null,"Artikelnummer",{"$nulls":3},"Anzahl","Einheit","Verkaufslänge","Brutto-VK-Preis","Summe Brutto-VK-Preis"]
[null,null,"Anzahl benötigter Bodenprofile in Länge 1000 mm",null,{"$f":"\"612 XXX.\"&K266&\".111\"","v":"612 XXX.1000.111"},{"$nulls":3},{"$f":"COUNTIF(H271:I273,K266)","v":0},"Stück",{"v":1000,"d":"1,000 mm"},{"$f":"$F$297","v":{"v":32.22,"d":"32.22 €"}},{"$f":"I266*L266","v":0}]
[null,null,"Anzahl benötigter Bodenprofile in Länge 1500 mm",null,{"$f":"\"612 XXX.\"&K267&\".111\"","v":"612 XXX.1500.111"},{"$nulls":3},{"$f":"COUNTIF(H271:I273,K267)","v":0},"Stück",{"v":1500,"d":"1,500 mm"},{"$f":"$F$298","v":{"v":48.33,"d":"48.33 €"}},{"$f":"I267*L267","v":0}]
[{"$nulls":12},{"$f":"M266+M267","v":0}]
[]
[{"$nulls":4},"Länge ben.",{"$nulls":3},"Verkaufslänge"]
[null,null,"Ungefähr benötigte Länge an Bodenprofil für alle zusammen",null,{"$f":"E200","v":{"v":2338,"d":"2,338 mm"}},{"$nulls":3},{"$f":"IF(E271<=1500,VLOOKUP(E271,$E$294:$I$295,2,TRUE),\"nicht vorhanden\")","v":"nicht vorhanden"}]
[]
[]
[null,null,"Summe",null,{"$f":"SUM(E271:F273)","v":{"v":2338,"d":"2,338 mm"}}]
[]
[null,null,"Ist die Variante eine mögliche Lösung?",null,{"$f":"IF(OR(I271=\"nicht vorhanden\",I272=\"nicht vorhanden\",I273=\"nicht vorhanden\"),\"Nein\",\"Ja\")","v":"Nein"}]
[]
[null,null,"Griff (optional, Aus- oder Abwahl siehe oben)"]
[]
[null,null,{"$f":"C192","v":"Description"},null,{"$f":"E192","v":"Article number"},{"$nulls":3},{"$f":"I192","v":"Quantity"},{"$f":"J192","v":"Unit"},{"$nulls":3},{"$f":"corner_1_sash!N212","v":"* With exactly vertical walls and horizontal floors."}]
[null,null,{"$f":"corner_1_sash!C213","v":"Round finger pull handle, diameter 39 mm (diameter of glass drill hole 10 mm), 1 pair for 1 sash (inside and outside), stainless steel"},null,"612 267.0000.020",{"$nulls":3},{"$f":"IF(U3_Wahl_Griff=\"Yes\",2,0)","v":2},{"$f":"corner_1_sash!J213","v":"pair"}]
[]
[]
[null,null,"Tabelle Profillängen"]
[{"$nulls":3},"Laufschiene/Blende",0,950,null,null,950,null,"mm"]
[{"$nulls":4},950.01,1150,null,null,1150,null,"mm"]
[{"$nulls":4},1150.01,1550,null,null,1550,null,"mm"]
[{"$nulls":4},1550.01,2050,null,null,2050,null,"mm"]
[{"$nulls":4},2050.01,4880,null,null,4880,null,"mm"]
[]
[{"$nulls":3},"Wandprofil/Dichtleisten",0,2000,null,null,2000,null,"mm"]
[{"$nulls":4},2000.01,2490,null,null,2490,null,"mm"]
[]
[{"$nulls":3},"Bodenprofil",0,1000,null,null,1000,null,"mm"]
[{"$nulls":4},1000.01,1500,null,null,1500,null,"mm"]
[]
[{"$nulls":3},"Brutto-VK-Bodenprofil",1000,32.22]
[{"$nulls":4},1500,48.33]
[]
[]
[null,{"$f":"Haftungsausschluss","v":"Willach assumes no liability for damage of any kind that could arise as a result of using this profile and glass dimensions calculator. (11.05.2016 Rev. 3)"}]

{"sheet":"Glass_drill_holes","index":9,"n_rows":66,"n_cols":15,"rows_kept":66,"merged":[[0,1,0,14],[3,1,3,11],[3,13,3,23],[4,1,21,11],[4,13,21,23],[25,1,25,11],[25,13,25,23],[65,2,66,10],[65,14,66,22],[68,2,68,22],[78,1,78,22]]}
[null,"Aquant 40: Glass drill holes"]
[]
[]
[null,"Installation situation",{"$nulls":11},"Installation situation"]
{"$rows_empty":21}
[null,"Drill holes",{"$nulls":11},"Drill holes"]
{"$rows_empty":39}
[null,null,"Only make the 10 mm glass drill hole if using the \nAquant handle.",{"$nulls":11},"Only make the 10 mm glass drill hole if using the \nAquant handle."]